program: Orca
programVersion: 5.0.2
elementType: Cl Cl O O O N C C C C C C C C C C C C C C C C C C C C C C H H H H H H H H H H H H H H H H H H H
charge: 0
multiplicity: 1
keywords: wb97x-d3
keywords: def2-TZVPP
keywords: def2/J RIJCOSX
keywords: DEFGRID2
keywords: scfconv7
keywords: smallprint printgap noloewdin
keywords: NOSOSCF
formula: C22H19Cl2NO3
InChI: InChI=1/C22H19Cl2NO3/c1-22(2)17(12-19(23)24)20(22)21(26)28-18(13-25)14-7-6-10-16(11-14)27-15-8-4-3-5-9-15/h3-12,17-18,20H,1-2H3
47 atoms
Cl -2.721393 3.692109 1.082442
Cl -3.239535 6.352638 0.088255
O  0.536843 1.004293 0.651629
O  -1.000191 0.345972 -0.833862
O  1.635599 -4.716722 -0.82448
N  1.715259 -0.2396 3.491273
C  -0.034898 3.000676 -2.265234
C  -1.383669 3.165659 -1.64859
C  -0.257284 2.623417 -0.80723
C  0.16224 1.93188 -3.312043
C  0.818907 4.226442 -2.487663
C  -1.954028 4.498226 -1.352271
C  -0.313467 1.214321 -0.373793
C  -2.556305 4.806302 -0.211455
C  0.63001 -0.32941 1.115642
C  1.461786 -1.209947 0.208575
C  1.241988 -0.252308 2.444892
C  1.134925 -2.553062 0.111933
C  2.550336 -0.6959 -0.481632
C  1.913732 -3.395995 -0.671462
C  3.300907 -1.541804 -1.28356
C  2.996148 -2.889207 -1.377726
C  1.059371 -5.406838 0.208082
C  1.594412 -5.369735 1.489904
C  -0.051558 -6.186717 -0.073258
C  1.000632 -6.11757 2.493973
C  -0.628792 -6.940171 0.938809
C  -0.110273 -6.90529 2.224307
H  -2.116758 2.41659 -1.938938
H  0.189059 3.298917 -0.086445
H  1.189025 1.561972 -3.302386
H  -0.027967 2.349548 -4.302201
H  -0.500307 1.080149 -3.179199
H  0.579896 4.692333 -3.445757
H  1.875872 3.957235 -2.50959
H  0.686296 4.97894 -1.709766
H  -1.913491 5.26256 -2.119568
H  -0.367082 -0.768732 1.231594
H  0.272371 -2.940519 0.640772
H  2.81569 0.349377 -0.399091
H  4.147739 -1.150605 -1.831317
H  3.588551 -3.552531 -1.993733
H  2.466084 -4.763557 1.702992
H  -0.453628 -6.202954 -1.077812
H  1.415827 -6.086929 3.492688
H  -1.493824 -7.552065 0.718803
H  -0.565972 -7.490274 3.01166
totalener: -2050.65889869 hartree
nucrepener: 2725.22264094 hartree
electener: -4775.88153963 hartree
oneelecener: -8225.85441508 hartree
twoeener: 3449.97287545 hartree
kineticenergy: 2044.53092918 hartree
xcener: -151.869880931589 hartree
chargesum: -0.0000000
charge: -0.029981 -0.038937 -0.267325 -0.359952 -0.297402 -0.000720 0.112381 -0.011695 -0.156350 -0.242784 -0.268836 -0.250601 0.339435 0.094260 0.301139 0.076223 -0.248658 -0.151976 -0.205225 0.204514 -0.091746 -0.187016 0.222444 -0.157025 -0.196971 -0.114333 -0.097415 -0.137648 0.109900 0.108973 0.084236 0.089073 0.103373 0.094807 0.094624 0.089420 0.118683 0.123927 0.112985 0.125572 0.127008 0.128707 0.137180 0.127502 0.131257 0.127076 0.127895
qa: -0.0300 -0.0389 -0.2673 -0.3600 -0.2974 -0.0007 0.1124 -0.0117 -0.1563 -0.2428 -0.2688 -0.2506 0.3394 0.0943 0.3011 0.0762 -0.2487 -0.1520 -0.2052 0.2045 -0.0917 -0.1870 0.2224 -0.1570 -0.1970 -0.1143 -0.0974 -0.1376 0.1099 0.1090 0.0842 0.0891 0.1034 0.0948 0.0946 0.0894 0.1187 0.1239 0.1130 0.1256 0.1270 0.1287 0.1372 0.1275 0.1313 0.1271 0.1279
va: 1.3026 1.2671 2.1102 2.1423 2.1121 3.1235 3.7371 3.8433 3.8636 3.8969 3.9122 3.9136 4.1986 4.2042 3.8406 3.6669 4.0107 3.9836 4.0047 3.8774 3.9489 4.0304 3.8183 3.9551 4.0367 3.9484 3.9327 3.9551 1.0269 1.0242 1.0049 1.0034 1.0192 1.0012 1.0068 1.0009 1.0170 1.0215 1.0149 1.0187 0.9995 1.0113 1.0022 1.0124 0.9991 0.9989 0.9998
dispcorr: -0.024501885 hartree
energy: -2050.683400573530
dipole: 19.29169 -19.17618 0.11551 -23.29725 23.36818 0.07094 -17.45009 15.92727 -1.52282
magnitude: 1.52884 au
magnitude: 3.88601 debye
