program: Orca
programVersion: 5.0.2
elementType: Cl Cl O O O N C C C C C C C C C C C C C C C C C C C C C C H H H H H H H H H H H H H H H H H H H
charge: 0
multiplicity: 1
keywords: wb97x-d3
keywords: def2-TZVPP
keywords: def2/J RIJCOSX
keywords: DEFGRID2
keywords: scfconv7
keywords: smallprint printgap noloewdin
keywords: NOSOSCF
formula: C22H19Cl2NO3
InChI: InChI=1/C22H19Cl2NO3/c1-22(2)17(12-19(23)24)20(22)21(26)28-18(13-25)14-7-6-10-16(11-14)27-15-8-4-3-5-9-15/h3-12,17-18,20H,1-2H3
47 atoms
Cl -2.601622 3.767627 1.207422
Cl -3.3067 6.29294 -0.001309
O  0.7575 1.1024 0.644613
O  -0.961304 0.283209 -0.528012
O  1.301234 -4.590465 -0.910731
N  2.432522 0.163707 3.337981
C  -0.232312 2.805816 -2.316598
C  -1.519677 2.98605 -1.582502
C  -0.293958 2.566153 -0.814952
C  -0.090407 1.64584 -3.270708
C  0.54079 4.033075 -2.738445
C  -2.109311 4.325549 -1.36457
C  -0.241543 1.202187 -0.253874
C  -2.602264 4.740348 -0.205388
C  0.952625 -0.182252 1.212134
C  1.626868 -1.139913 0.256788
C  1.7829 0.031575 2.400087
C  1.129007 -2.425303 0.127447
C  2.738609 -0.735987 -0.472719
C  1.760525 -3.324599 -0.724014
C  3.340506 -1.632302 -1.340107
C  2.863676 -2.928111 -1.4649
C  0.825528 -5.305091 0.153328
C  1.461907 -5.301165 1.388692
C  -0.299118 -6.087914 -0.058845
C  0.955632 -6.084089 2.414328
C  -0.786939 -6.875273 0.972749
C  -0.167785 -6.873124 2.213651
H  -2.247519 2.190525 -1.724196
H  0.194951 3.321095 -0.209829
H  0.94901 1.31886 -3.332637
H  -0.399325 1.953325 -4.271158
H  -0.693621 0.786551 -2.987934
H  1.601206 3.799967 -2.843132
H  0.45185 4.850857 -2.022809
H  0.187448 4.397501 -3.705154
H  -2.174226 5.004742 -2.206639
H  -0.001252 -0.607304 1.542664
H  0.246651 -2.725494 0.679287
H  3.132587 0.266351 -0.366563
H  4.203966 -1.326523 -1.915471
H  3.339565 -3.634074 -2.132429
H  2.346201 -4.698246 1.55098
H  -0.780313 -6.079632 -1.027864
H  1.451611 -6.079751 3.375889
H  -1.66264 -7.487869 0.804442
H  -0.554519 -7.484472 3.0175
totalener: -2050.65906576 hartree
nucrepener: 2728.24783020 hartree
electener: -4778.90689597 hartree
oneelecener: -8231.90080332 hartree
twoeener: 3452.99390735 hartree
kineticenergy: 2044.53920837 hartree
xcener: -151.870907501231 hartree
chargesum: -0.0000000
charge: -0.030289 -0.039139 -0.261644 -0.361304 -0.298634 -0.000708 0.111825 -0.007035 -0.159860 -0.244368 -0.270543 -0.250339 0.348734 0.092509 0.308663 0.058650 -0.251898 -0.129231 -0.213112 0.199722 -0.090396 -0.187043 0.234105 -0.160285 -0.207045 -0.116327 -0.090343 -0.144590 0.109156 0.107815 0.086755 0.088088 0.102223 0.095252 0.089752 0.094401 0.118874 0.119604 0.115527 0.126280 0.128886 0.130126 0.136235 0.126602 0.130485 0.126479 0.127386
qa: -0.0303 -0.0391 -0.2616 -0.3613 -0.2986 -0.0007 0.1118 -0.0070 -0.1599 -0.2444 -0.2705 -0.2503 0.3487 0.0925 0.3087 0.0586 -0.2519 -0.1292 -0.2131 0.1997 -0.0904 -0.1870 0.2341 -0.1603 -0.2070 -0.1163 -0.0903 -0.1446 0.1092 0.1078 0.0868 0.0881 0.1022 0.0953 0.0898 0.0944 0.1189 0.1196 0.1155 0.1263 0.1289 0.1301 0.1362 0.1266 0.1305 0.1265 0.1274
va: 1.3015 1.2666 2.1216 2.1451 2.1109 3.1214 3.7402 3.8343 3.8675 3.8995 3.9123 3.9109 4.2035 4.2053 3.8450 3.6279 4.0193 3.9678 4.0143 3.8856 3.9366 4.0342 3.8104 3.9384 4.0386 3.9519 3.9330 3.9610 1.0271 1.0240 1.0039 1.0033 1.0188 1.0067 1.0005 1.0012 1.0169 1.0213 1.0152 1.0187 0.9988 1.0105 1.0030 1.0135 0.9993 0.9987 1.0000
dispcorr: -0.024463968 hartree
energy: -2050.683529731652
dipole: 17.26564 -17.34616 -0.08052 -25.04143 24.95167 -0.08976 -18.04065 16.49304 -1.54761
magnitude: 1.55230 au
magnitude: 3.94563 debye
