program: Orca
programVersion: 5.0.2
elementType: Cl Cl O O O N C C C C C C C C C C C C C C C C C C C C C C H H H H H H H H H H H H H H H H H H H
charge: 0
multiplicity: 1
keywords: wb97x-d3
keywords: def2-TZVPP
keywords: def2/J RIJCOSX
keywords: DEFGRID2
keywords: scfconv7
keywords: smallprint printgap noloewdin
keywords: NOSOSCF
formula: C22H19Cl2NO3
InChI: InChI=1/C22H19Cl2NO3/c1-22(2)17(12-19(23)24)20(22)21(26)28-18(13-25)14-7-6-10-16(11-14)27-15-8-4-3-5-9-15/h3-12,17-18,20H,1-2H3
47 atoms
Cl -3.588721 3.612042 1.359139
Cl -3.342805 5.827114 -0.473453
O  1.852621 1.125879 -0.246915
O  0.103878 0.189605 0.791715
O  1.894573 -4.46034 0.362923
N  4.933685 1.775572 0.761693
C  -1.448834 1.136061 -1.745504
C  -1.66411 2.119087 -0.634361
C  -0.251717 1.714272 -1.017168
C  -1.880173 -0.293085 -1.515972
C  -1.61898 1.575151 -3.181176
C  -2.09462 3.501027 -0.878366
C  0.53898 0.921026 -0.05572
C  -2.900518 4.209554 -0.096799
C  2.744438 0.364438 0.566048
C  2.992141 -0.993147 -0.043876
C  3.968598 1.160958 0.663081
C  2.332352 -2.094416 0.482235
C  3.816554 -1.128407 -1.154404
C  2.488271 -3.337432 -0.119129
C  3.977529 -2.376069 -1.733117
C  3.310979 -3.480627 -1.227448
C  0.637204 -4.403983 0.896953
C  0.392041 -5.179924 2.019933
C  -0.380792 -3.65518 0.319998
C  -0.882017 -5.20922 2.565369
C  -1.647047 -3.686537 0.882278
C  -1.90573 -4.461633 2.003149
H  -2.01243 1.680006 0.293418
H  0.326152 2.438169 -1.580336
H  -1.260715 -0.980664 -2.095623
H  -2.91121 -0.417546 -1.850805
H  -1.829437 -0.590969 -0.471835
H  -1.218106 2.568412 -3.379071
H  -2.674478 1.582619 -3.45742
H  -1.104444 0.882948 -3.848912
H  -1.725235 4.001473 -1.764579
H  2.339304 0.253285 1.576449
H  1.688682 -1.97979 1.344799
H  4.338878 -0.271158 -1.559701
H  4.623142 -2.491265 -2.593142
H  3.428009 -4.455959 -1.680954
H  1.196514 -5.758403 2.454549
H  -0.192432 -3.050353 -0.557587
H  -1.070813 -5.816762 3.440407
H  -2.43847 -3.100719 0.43349
H  -2.896949 -4.482439 2.434884
totalener: -2050.66127958 hartree
nucrepener: 2763.35962187 hartree
electener: -4814.02090145 hartree
oneelecener: -8301.75319037 hartree
twoeener: 3487.73228892 hartree
kineticenergy: 2044.53310487 hartree
xcener: -151.871738295637 hartree
chargesum: 0.0000000
charge: -0.038194 -0.042588 -0.255794 -0.385616 -0.297584 -0.001448 0.090049 0.040071 -0.098565 -0.273512 -0.250664 -0.203299 0.372400 0.051711 0.313386 0.000075 -0.256688 -0.145215 -0.175798 0.225452 -0.094114 -0.197817 0.244430 -0.212361 -0.153768 -0.090192 -0.098612 -0.148685 0.088994 0.082931 0.090662 0.096609 0.093016 0.076539 0.101002 0.094830 0.096645 0.122001 0.132907 0.121485 0.130315 0.129860 0.125849 0.125197 0.126037 0.122400 0.125660
qa: -0.0382 -0.0426 -0.2558 -0.3856 -0.2976 -0.0014 0.0900 0.0401 -0.0986 -0.2735 -0.2507 -0.2033 0.3724 0.0517 0.3134 0.0001 -0.2567 -0.1452 -0.1758 0.2255 -0.0941 -0.1978 0.2444 -0.2124 -0.1538 -0.0902 -0.0986 -0.1487 0.0890 0.0829 0.0907 0.0966 0.0930 0.0765 0.1010 0.0948 0.0966 0.1220 0.1329 0.1215 0.1303 0.1299 0.1258 0.1252 0.1260 0.1224 0.1257
va: 1.2890 1.2624 2.1378 2.1092 2.1190 3.1164 3.7304 3.8354 3.8834 3.9226 3.9129 3.9248 4.2146 4.2558 3.8360 3.6675 4.0205 3.9112 4.0441 3.8701 3.9424 4.0452 3.8367 4.0368 3.9426 3.9377 3.9486 3.9911 1.0478 1.0352 0.9984 1.0038 1.0171 1.0102 1.0020 1.0041 1.0321 1.0183 1.0203 1.0162 0.9995 1.0115 1.0139 1.0000 0.9985 1.0006 1.0008
dispcorr: -0.025012743 hartree
energy: -2050.686292321281
dipole: 5.91281 -6.91660 -1.00379 -31.66430 30.72836 -0.93595 -13.51330 12.42291 -1.09039
magnitude: 1.75286 au
magnitude: 4.45543 debye
