program: Orca
programVersion: 5.0.2
elementType: Cl Cl O O O N C C C C C C C C C C C C C C C C C C C C C C H H H H H H H H H H H H H H H H H H H
charge: 0
multiplicity: 1
keywords: wb97x-d3
keywords: def2-TZVPP
keywords: def2/J RIJCOSX
keywords: DEFGRID2
keywords: scfconv7
keywords: smallprint printgap noloewdin
keywords: NOSOSCF
formula: C22H19Cl2NO3
InChI: InChI=1/C22H19Cl2NO3/c1-22(2)17(12-19(23)24)20(22)21(26)28-18(13-25)14-7-6-10-16(11-14)27-15-8-4-3-5-9-15/h3-12,17-18,20H,1-2H3
47 atoms
Cl -2.980729 3.860263 0.768359
Cl -3.230209 6.513125 -0.342281
O  0.313518 0.985958 0.822532
O  -1.011369 0.409781 -0.886415
O  1.762046 -4.578122 -0.89013
N  1.14425 -0.417157 3.707898
C  0.264227 3.079185 -2.027258
C  -1.181727 3.254141 -1.694571
C  -0.259728 2.673587 -0.656947
C  0.663793 2.033441 -3.039058
C  1.156155 4.29724 -2.035366
C  -1.769289 4.598998 -1.505621
C  -0.392633 1.249497 -0.295701
C  -2.554866 4.941168 -0.493522
C  0.377935 -0.372645 1.210428
C  1.352875 -1.169149 0.371141
C  0.807444 -0.371979 2.610971
C  1.075903 -2.502354 0.118797
C  2.521903 -0.588557 -0.102152
C  1.985371 -3.270405 -0.598181
C  3.404033 -1.356981 -0.845322
C  3.148812 -2.696224 -1.090386
C  1.126244 -5.376242 0.021038
C  1.464331 -5.361939 1.36882
C  0.159586 -6.247916 -0.455722
C  0.816712 -6.223978 2.239027
C  -0.471445 -7.113895 0.42481
C  -0.152036 -7.102007 1.774061
H  -1.852162 2.529012 -2.150007
H  0.042181 3.319813 0.159296
H  0.679011 2.476833 -4.036323
H  -0.014203 1.183518 -3.065633
H  1.666559 1.654773 -2.832055
H  1.126392 4.789538 -3.009483
H  2.19162 4.013802 -1.841672
H  0.868515 5.032196 -1.28316
H  -1.573517 5.352541 -2.259888
H  -0.612075 -0.838846 1.160181
H  0.153273 -2.942972 0.477065
H  2.748181 0.44868 0.105214
H  4.31485 -0.912958 -1.224093
H  3.843544 -3.300882 -1.658049
H  2.226302 -4.687738 1.738739
H  -0.088395 -6.246816 -1.50893
H  1.078528 -6.209761 3.288654
H  -1.223974 -7.795533 0.051247
H  -0.651306 -7.773951 2.458717
totalener: -2050.65883096 hartree
nucrepener: 2723.13881330 hartree
electener: -4773.79764426 hartree
oneelecener: -8221.61610858 hartree
twoeener: 3447.81846433 hartree
kineticenergy: 2044.54460699 hartree
xcener: -151.872604630458 hartree
chargesum: -0.0000000
charge: -0.029389 -0.039514 -0.265937 -0.357686 -0.297675 -0.000191 0.111657 -0.004544 -0.160372 -0.242176 -0.267958 -0.251606 0.336582 0.092061 0.304142 0.091439 -0.251232 -0.163447 -0.219240 0.209665 -0.086508 -0.187603 0.232397 -0.160682 -0.206423 -0.113884 -0.091039 -0.143422 0.108523 0.108678 0.090298 0.103265 0.083374 0.094248 0.094500 0.089880 0.118601 0.124227 0.113916 0.127222 0.127194 0.129117 0.137143 0.126861 0.131344 0.126715 0.127478
qa: -0.0294 -0.0395 -0.2659 -0.3577 -0.2977 -0.0002 0.1117 -0.0045 -0.1604 -0.2422 -0.2680 -0.2516 0.3366 0.0921 0.3041 0.0914 -0.2512 -0.1634 -0.2192 0.2097 -0.0865 -0.1876 0.2324 -0.1607 -0.2064 -0.1139 -0.0910 -0.1434 0.1085 0.1087 0.0903 0.1033 0.0834 0.0942 0.0945 0.0899 0.1186 0.1242 0.1139 0.1272 0.1272 0.1291 0.1371 0.1269 0.1313 0.1267 0.1275
va: 1.3016 1.2659 2.1098 2.1456 2.1126 3.1228 3.7402 3.8394 3.8618 3.8952 3.9115 3.9097 4.2174 4.2086 3.8334 3.6369 4.0146 3.9959 4.0009 3.8752 3.9386 4.0356 3.8071 3.9442 4.0404 3.9494 3.9324 3.9607 1.0269 1.0240 1.0034 1.0192 1.0056 1.0017 1.0067 1.0004 1.0172 1.0218 1.0143 1.0182 0.9994 1.0110 1.0025 1.0132 0.9992 0.9987 1.0000
dispcorr: -0.024686857 hartree
energy: -2050.683517813341
dipole: 22.70314 -22.28322 0.41991 -23.89775 24.00578 0.10803 -14.30344 12.83587 -1.46758
magnitude: 1.53029 au
magnitude: 3.88968 debye
