program: Orca
programVersion: 5.0.2
elementType: Cl Cl O O O N C C C C C C C C C C C C C C C C C C C C C C H H H H H H H H H H H H H H H H H H H
charge: 0
multiplicity: 1
keywords: wb97x-d3
keywords: def2-TZVPP
keywords: def2/J RIJCOSX
keywords: DEFGRID2
keywords: scfconv7
keywords: smallprint printgap noloewdin
keywords: NOSOSCF
formula: C22H19Cl2NO3
InChI: InChI=1/C22H19Cl2NO3/c1-22(2)17(12-19(23)24)20(22)21(26)28-18(13-25)14-7-6-10-16(11-14)27-15-8-4-3-5-9-15/h3-12,17-18,20H,1-2H3
47 atoms
Cl -2.055901 3.155519 -2.49324
Cl -3.955542 5.194447 -1.737538
O  0.281142 0.509968 -0.510306
O  1.759201 2.183891 -0.69119
O  1.627407 -4.03753 2.188978
N  -0.186648 -1.961842 -2.656359
C  -0.124559 3.600386 1.36546
C  -0.434902 4.068654 -0.016105
C  -0.395693 2.584815 0.266316
C  1.266267 3.802128 1.914942
C  -1.202038 3.701324 2.418757
C  -1.721456 4.720428 -0.345029
C  0.677747 1.784188 -0.352316
C  -2.477103 4.395109 -1.385385
C  1.21091 -0.394496 -1.10217
C  1.970028 -1.152342 -0.04084
C  0.420464 -1.27449 -1.965135
C  1.416672 -2.281956 0.548274
C  3.203496 -0.670983 0.378351
C  2.112841 -2.940196 1.55361
C  3.879642 -1.327771 1.395495
C  3.344973 -2.461212 1.981862
C  0.795293 -4.897395 1.522764
C  -0.39551 -5.251224 2.136143
C  1.151791 -5.442295 0.295866
C  -1.235671 -6.164979 1.516596
C  0.298335 -6.345065 -0.317272
C  -0.896246 -6.709635 0.287783
H  0.417951 4.435853 -0.582282
H  -1.350854 2.077705 0.334294
H  1.317746 4.763304 2.429401
H  2.033132 3.796296 1.145064
H  1.511989 3.026382 2.64193
H  -2.201197 3.538583 2.013999
H  -1.189521 4.687732 2.886547
H  -1.039021 2.962335 3.204184
H  -2.062937 5.533545 0.285081
H  1.915269 0.149628 -1.738165
H  0.454081 -2.655075 0.219105
H  3.627537 0.212789 -0.079085
H  4.84111 -0.959573 1.727296
H  3.874569 -2.984235 2.767187
H  -0.653921 -4.817237 3.092998
H  2.085969 -5.165671 -0.175992
H  -2.164612 -6.443816 1.995948
H  0.572298 -6.767115 -1.274893
H  -1.556921 -7.415495 -0.196599
totalener: -2050.66016312 hartree
nucrepener: 2734.56324913 hartree
electener: -4785.22341225 hartree
oneelecener: -8244.80677940 hartree
twoeener: 3459.58336715 hartree
kineticenergy: 2044.53845821 hartree
xcener: -151.871439612311 hartree
chargesum: 0.0000000
charge: -0.026463 -0.039550 -0.254505 -0.391664 -0.297830 -0.002952 0.116003 -0.013202 -0.170186 -0.254021 -0.267432 -0.251815 0.391470 0.094926 0.317650 0.001332 -0.258786 -0.167889 -0.148179 0.201600 -0.096442 -0.192495 0.220495 -0.197926 -0.149468 -0.097368 -0.103656 -0.135321 0.108878 0.109130 0.086390 0.102456 0.090776 0.089105 0.092761 0.097078 0.118877 0.124740 0.129536 0.128611 0.128051 0.128836 0.125778 0.131505 0.126255 0.127937 0.126973
qa: -0.0265 -0.0396 -0.2545 -0.3917 -0.2978 -0.0030 0.1160 -0.0132 -0.1702 -0.2540 -0.2674 -0.2518 0.3915 0.0949 0.3176 0.0013 -0.2588 -0.1679 -0.1482 0.2016 -0.0964 -0.1925 0.2205 -0.1979 -0.1495 -0.0974 -0.1037 -0.1353 0.1089 0.1091 0.0864 0.1025 0.0908 0.0891 0.0928 0.0971 0.1189 0.1247 0.1295 0.1286 0.1281 0.1288 0.1258 0.1315 0.1263 0.1279 0.1270
va: 1.3072 1.2659 2.1253 2.1084 2.1110 3.1138 3.7207 3.8378 3.9002 3.9019 3.9157 3.9070 4.1546 4.2061 3.8242 3.7130 4.0290 3.9789 3.9610 3.8798 3.9556 4.0316 3.8237 4.0414 3.9635 3.9381 3.9549 3.9621 1.0255 1.0241 1.0028 1.0200 1.0017 1.0006 1.0017 1.0060 1.0177 1.0223 1.0166 1.0200 0.9998 1.0117 1.0128 1.0033 0.9990 1.0001 1.0001
dispcorr: -0.024211339 hartree
energy: -2050.684374462075
dipole: 17.61819 -17.15208 0.46611 -13.90053 14.45666 0.55612 25.30354 -23.84255 1.46099
magnitude: 1.63126 au
magnitude: 4.14634 debye
