program: Orca
programVersion: 5.0.2
elementType: Cl Cl O O O N C C C C C C C C C C C C C C C C C C C C C C H H H H H H H H H H H H H H H H H H H
charge: 0
multiplicity: 1
keywords: wb97x-d3
keywords: def2-TZVPP
keywords: def2/J RIJCOSX
keywords: DEFGRID2
keywords: scfconv7
keywords: smallprint printgap noloewdin
keywords: NOSOSCF
formula: C22H19Cl2NO3
InChI: InChI=1/C22H19Cl2NO3/c1-22(2)17(12-19(23)24)20(22)21(26)28-18(13-25)14-7-6-10-16(11-14)27-15-8-4-3-5-9-15/h3-12,17-18,20H,1-2H3
47 atoms
Cl -2.984604 3.752412 0.75598
Cl -3.313281 6.354496 -0.449058
O  0.365059 1.012331 0.968637
O  -0.880871 0.310772 -0.751287
O  2.030935 -4.421433 -0.81186
N  1.117445 -0.252514 3.941987
C  0.295187 2.96948 -1.995421
C  -1.155712 3.115096 -1.671639
C  -0.217715 2.608277 -0.608367
C  0.725966 1.89311 -2.961129
C  1.151001 4.212026 -2.057704
C  -1.78546 4.447284 -1.537626
C  -0.311927 1.199299 -0.181656
C  -2.586781 4.801082 -0.541945
C  0.473115 -0.329499 1.410952
C  1.519159 -1.099533 0.637026
C  0.835665 -0.260513 2.828702
C  1.257876 -2.410828 0.274929
C  2.731045 -0.503111 0.31576
C  2.227079 -3.141085 -0.403417
C  3.678661 -1.234288 -0.382364
C  3.438532 -2.551067 -0.73812
C  1.189189 -5.234869 -0.101522
C  1.360769 -5.433931 1.262721
C  0.186336 -5.895591 -0.793242
C  0.510796 -6.298837 1.933307
C  -0.650902 -6.76729 -0.111657
C  -0.497062 -6.967458 1.251615
H  -1.80295 2.350495 -2.094999
H  0.060082 3.300105 0.17841
H  0.069001 1.026991 -2.954731
H  1.735919 1.547626 -2.733847
H  0.735763 2.294476 -3.975831
H  1.101697 4.664496 -3.050166
H  2.195314 3.96636 -1.860227
H  0.846318 4.967432 -1.332927
H  -1.60927 5.177877 -2.318715
H  -0.491735 -0.842321 1.335343
H  0.30016 -2.857357 0.512466
H  2.937799 0.517994 0.607278
H  4.625561 -0.779339 -0.640384
H  4.180973 -3.126797 -1.274574
H  2.15149 -4.920931 1.796043
H  0.070174 -5.728304 -1.856099
H  0.642805 -6.454028 2.996006
H  -1.432283 -7.285669 -0.651817
H  -1.155364 -7.643115 1.78072
totalener: -2050.65917728 hartree
nucrepener: 2730.20247793 hartree
electener: -4780.86165521 hartree
oneelecener: -8235.80963808 hartree
twoeener: 3454.94798287 hartree
kineticenergy: 2044.53602475 hartree
xcener: -151.870432859356 hartree
chargesum: -0.0000000
charge: -0.029514 -0.039629 -0.264211 -0.362034 -0.296696 -0.000621 0.112586 -0.005377 -0.158533 -0.243890 -0.268547 -0.251350 0.341301 0.092527 0.306670 0.059531 -0.251723 -0.133009 -0.216771 0.206820 -0.089150 -0.188070 0.220936 -0.159238 -0.192627 -0.114100 -0.097987 -0.136171 0.108756 0.107705 0.102983 0.085754 0.088719 0.094143 0.094799 0.089467 0.118495 0.121865 0.112680 0.125612 0.128265 0.129199 0.137069 0.127098 0.130966 0.127453 0.127849
qa: -0.0295 -0.0396 -0.2642 -0.3620 -0.2967 -0.0006 0.1126 -0.0054 -0.1585 -0.2439 -0.2685 -0.2513 0.3413 0.0925 0.3067 0.0595 -0.2517 -0.1330 -0.2168 0.2068 -0.0891 -0.1881 0.2209 -0.1592 -0.1926 -0.1141 -0.0980 -0.1362 0.1088 0.1077 0.1030 0.0858 0.0887 0.0941 0.0948 0.0895 0.1185 0.1219 0.1127 0.1256 0.1283 0.1292 0.1371 0.1271 0.1310 0.1275 0.1278
va: 1.3018 1.2659 2.1142 2.1422 2.1123 3.1227 3.7400 3.8373 3.8651 3.8985 3.9123 3.9098 4.2133 4.2077 3.8363 3.6615 4.0187 3.9648 4.0087 3.8767 3.9408 4.0296 3.8222 3.9624 4.0368 3.9449 3.9336 3.9560 1.0265 1.0242 1.0192 1.0044 1.0032 1.0017 1.0065 1.0005 1.0172 1.0229 1.0166 1.0194 0.9989 1.0113 1.0022 1.0126 0.9993 0.9989 0.9999
dispcorr: -0.024577727 hartree
energy: -2050.683755010567
dipole: 22.53964 -22.15198 0.38766 -23.57645 23.56901 -0.00743 -14.64176 13.10496 -1.53680
magnitude: 1.58496 au
magnitude: 4.02864 debye
