program: Orca
programVersion: 5.0.2
elementType: Cl Cl O O O N C C C C C C C C C C C C C C C C C C C C C C H H H H H H H H H H H H H H H H H H H
charge: 0
multiplicity: 1
keywords: wb97x-d3
keywords: def2-TZVPP
keywords: def2/J RIJCOSX
keywords: DEFGRID2
keywords: scfconv7
keywords: smallprint printgap noloewdin
keywords: NOSOSCF
formula: C22H19Cl2NO3
InChI: InChI=1/C22H19Cl2NO3/c1-22(2)17(12-19(23)24)20(22)21(26)28-18(13-25)14-7-6-10-16(11-14)27-15-8-4-3-5-9-15/h3-12,17-18,20H,1-2H3
47 atoms
Cl -3.141647 3.612834 0.471674
Cl -3.356451 6.38959 -0.289224
O  0.122701 0.909001 0.835849
O  -0.686896 0.518897 -1.212791
O  2.128167 -4.50695 -0.829682
N  0.088885 -0.762657 3.696909
C  0.604362 3.369817 -1.711676
C  -0.885618 3.445078 -1.656186
C  -0.146352 2.754855 -0.539622
C  1.251955 2.494159 -2.755236
C  1.404188 4.607383 -1.378851
C  -1.58574 4.724072 -1.405989
C  -0.28247 1.29299 -0.39176
C  -2.562139 4.884778 -0.523033
C  0.096976 -0.481289 1.098135
C  1.289732 -1.209876 0.519218
C  0.091902 -0.614805 2.557766
C  1.1257 -2.517672 0.090658
C  2.535046 -0.599801 0.465712
C  2.223144 -3.229915 -0.377348
C  3.614582 -1.310789 -0.034776
C  3.47026 -2.624383 -0.448333
C  1.234668 -5.369726 -0.255977
C  1.139108 -5.51245 1.122829
C  0.458545 -6.14611 -1.102208
C  0.250366 -6.437454 1.647448
C  -0.418112 -7.076365 -0.563556
C  -0.530651 -7.222091 0.810671
H  -1.406993 2.768117 -2.329073
H  -0.053691 3.293292 0.396383
H  2.217476 2.123317 -2.407166
H  1.429662 3.075336 -3.661556
H  0.643796 1.635097 -3.028091
H  1.538174 5.228321 -2.266706
H  2.395864 4.336336 -1.014531
H  0.927037 5.220106 -0.613686
H  -1.306639 5.585504 -2.001709
H  -0.825796 -0.931022 0.715592
H  0.14664 -2.980766 0.119054
H  2.668366 0.416296 0.811554
H  4.588279 -0.84238 -0.086125
H  4.314633 -3.185798 -0.825501
H  1.752649 -4.911715 1.782249
H  0.549275 -6.02246 -2.173308
H  0.17485 -6.54805 2.72103
H  -1.020753 -7.684148 -1.22541
H  -1.219129 -7.944042 1.228195
totalener: -2050.65907397 hartree
nucrepener: 2718.85164544 hartree
electener: -4769.51071941 hartree
oneelecener: -8213.09073367 hartree
twoeener: 3443.58001426 hartree
kineticenergy: 2044.53498047 hartree
xcener: -151.870766930582 hartree
chargesum: -0.0000000
charge: -0.029484 -0.039352 -0.268071 -0.361122 -0.297453 -0.001005 0.112331 -0.005790 -0.165051 -0.243357 -0.267862 -0.252533 0.344669 0.094368 0.303690 0.077506 -0.250018 -0.158551 -0.200890 0.207831 -0.093519 -0.187262 0.230800 -0.160471 -0.203592 -0.113095 -0.092730 -0.140480 0.108264 0.109837 0.085237 0.088548 0.102909 0.094051 0.094758 0.090445 0.119016 0.123661 0.113680 0.125795 0.126922 0.129520 0.136535 0.126767 0.131077 0.126067 0.127404
qa: -0.0295 -0.0394 -0.2681 -0.3611 -0.2975 -0.0010 0.1123 -0.0058 -0.1651 -0.2434 -0.2679 -0.2525 0.3447 0.0944 0.3037 0.0775 -0.2500 -0.1586 -0.2009 0.2078 -0.0935 -0.1873 0.2308 -0.1605 -0.2036 -0.1131 -0.0927 -0.1405 0.1083 0.1098 0.0852 0.0885 0.1029 0.0941 0.0948 0.0904 0.1190 0.1237 0.1137 0.1258 0.1269 0.1295 0.1365 0.1268 0.1311 0.1261 0.1274
va: 1.3023 1.2662 2.1095 2.1424 2.1119 3.1231 3.7368 3.8378 3.8690 3.8989 3.9126 3.9115 4.1989 4.2063 3.8368 3.6640 4.0119 3.9890 4.0032 3.8777 3.9493 4.0319 3.8089 3.9522 4.0383 3.9477 3.9326 3.9590 1.0273 1.0239 1.0043 1.0032 1.0194 1.0018 1.0068 1.0002 1.0174 1.0230 1.0147 1.0190 0.9997 1.0111 1.0027 1.0132 0.9992 0.9990 1.0001
dispcorr: -0.024343038 hartree
energy: -2050.683417006451
dipole: 25.67789 -24.93890 0.73899 -20.88583 21.18603 0.30021 -12.03796 10.71001 -1.32795
magnitude: 1.54909 au
magnitude: 3.93747 debye
