program: Orca
programVersion: 5.0.2
elementType: Cl Cl O O O N C C C C C C C C C C C C C C C C C C C C C C H H H H H H H H H H H H H H H H H H H
charge: 0
multiplicity: 1
keywords: wb97x-d3
keywords: def2-TZVPP
keywords: def2/J RIJCOSX
keywords: DEFGRID2
keywords: scfconv7
keywords: smallprint printgap noloewdin
keywords: NOSOSCF
formula: C22H19Cl2NO3
InChI: InChI=1/C22H19Cl2NO3/c1-22(2)17(12-19(23)24)20(22)21(26)28-18(13-25)14-7-6-10-16(11-14)27-15-8-4-3-5-9-15/h3-12,17-18,20H,1-2H3
47 atoms
Cl -2.089071 3.129922 -2.467122
Cl -3.999525 5.144113 -1.67307
O  0.307917 0.523504 -0.539964
O  1.780903 2.199745 -0.742271
O  1.638057 -4.016808 2.165322
N  -0.168539 -1.948287 -2.687935
C  -0.067424 3.620136 1.339315
C  -0.420914 4.075179 -0.036161
C  -0.357341 2.593681 0.255326
C  1.335409 3.842586 1.848462
C  -1.115911 3.716113 2.421782
C  -1.723919 4.708927 -0.335073
C  0.706518 1.797478 -0.384457
C  -2.499817 4.370137 -1.356023
C  1.233211 -0.3826 -1.135924
C  1.990894 -1.140518 -0.07379
C  0.43872 -1.259429 -1.998229
C  1.435481 -2.268036 0.517078
C  3.222509 -0.65721 0.34882
C  2.127223 -2.921872 1.528437
C  3.89417 -1.309542 1.371688
C  3.357009 -2.440624 1.960565
C  0.816616 -4.88197 1.492556
C  -0.383083 -5.233531 2.089285
C  1.192292 -5.432875 0.274178
C  -1.21273 -6.151354 1.461412
C  0.349303 -6.339495 -0.347488
C  -0.853993 -6.702093 0.240934
H  0.411786 4.448046 -0.628112
H  -1.305422 2.078016 0.352283
H  1.389244 4.808612 2.35322
H  2.080753 3.838521 1.057992
H  1.609793 3.076193 2.575005
H  -2.123296 3.530785 2.048523
H  -1.107124 4.708375 2.876928
H  -0.917211 2.990291 3.211173
H  -2.06135 5.518758 0.301328
H  1.937599 0.159973 -1.773085
H  0.474189 -2.642509 0.185507
H  3.648233 0.225009 -0.11015
H  4.853787 -0.93939 1.706654
H  3.882991 -2.95977 2.750858
H  -0.656801 -4.794523 3.039484
H  2.133333 -5.157615 -0.184365
H  -2.148812 -6.428234 1.927511
H  0.638399 -6.766513 -1.298368
H  -1.506708 -7.410794 -0.250033
totalener: -2050.66007625 hartree
nucrepener: 2735.80090328 hartree
electener: -4786.46097952 hartree
oneelecener: -8247.27993758 hartree
twoeener: 3460.81895805 hartree
kineticenergy: 2044.54220277 hartree
xcener: -151.872072640753 hartree
chargesum: 0.0000000
charge: -0.026341 -0.039428 -0.254428 -0.391439 -0.297958 -0.003005 0.116286 -0.013536 -0.170550 -0.254417 -0.267328 -0.250538 0.391317 0.094343 0.316738 0.002579 -0.258264 -0.166067 -0.149192 0.199226 -0.096304 -0.192130 0.218493 -0.197082 -0.147463 -0.097950 -0.104349 -0.134607 0.109128 0.108754 0.086451 0.103002 0.090294 0.089074 0.092827 0.096762 0.118678 0.124904 0.129272 0.128876 0.128228 0.128854 0.126012 0.131315 0.126145 0.127811 0.127006
qa: -0.0263 -0.0394 -0.2544 -0.3914 -0.2980 -0.0030 0.1163 -0.0135 -0.1705 -0.2544 -0.2673 -0.2505 0.3913 0.0943 0.3167 0.0026 -0.2583 -0.1661 -0.1492 0.1992 -0.0963 -0.1921 0.2185 -0.1971 -0.1475 -0.0980 -0.1043 -0.1346 0.1091 0.1088 0.0865 0.1030 0.0903 0.0891 0.0928 0.0968 0.1187 0.1249 0.1293 0.1289 0.1282 0.1289 0.1260 0.1313 0.1261 0.1278 0.1270
va: 1.3075 1.2660 2.1246 2.1086 2.1103 3.1136 3.7206 3.8396 3.9013 3.9018 3.9159 3.9072 4.1543 4.2063 3.8244 3.7136 4.0295 3.9775 3.9604 3.8803 3.9552 4.0320 3.8264 4.0402 3.9625 3.9388 3.9555 3.9620 1.0250 1.0244 1.0028 1.0203 1.0019 1.0007 1.0016 1.0061 1.0176 1.0227 1.0168 1.0197 0.9997 1.0116 1.0127 1.0034 0.9991 1.0002 1.0001
dispcorr: -0.024226310 hartree
energy: -2050.684302554992
dipole: 18.23802 -17.75239 0.48563 -13.57275 14.13132 0.55857 24.89319 -23.43249 1.46070
magnitude: 1.63752 au
magnitude: 4.16224 debye
