program: Orca
programVersion: 5.0.2
elementType: Cl Cl O O O N C C C C C C C C C C C C C C C C C C C C C C H H H H H H H H H H H H H H H H H H H
charge: 0
multiplicity: 1
keywords: wb97x-d3
keywords: def2-TZVPP
keywords: def2/J RIJCOSX
keywords: DEFGRID2
keywords: scfconv7
keywords: smallprint printgap noloewdin
keywords: NOSOSCF
formula: C22H19Cl2NO3
InChI: InChI=1/C22H19Cl2NO3/c1-22(2)17(12-19(23)24)20(22)21(26)28-18(13-25)14-7-6-10-16(11-14)27-15-8-4-3-5-9-15/h3-12,17-18,20H,1-2H3
47 atoms
Cl -2.004588 2.531874 -2.483912
Cl -4.511397 3.795489 -1.804827
O  0.933482 0.632577 -0.190675
O  1.745132 2.687538 -0.584901
O  1.623418 -4.030299 1.957393
N  1.262102 -0.995453 -3.083983
C  -0.491872 3.490169 1.491626
C  -0.907241 3.806125 0.09547
C  -0.409726 2.41689 0.417405
C  0.758892 4.128904 2.04131
C  -1.560696 3.265406 2.534454
C  -2.323592 4.01293 -0.278489
C  0.870248 1.9791 -0.170192
C  -2.87243 3.512945 -1.377834
C  2.056506 0.023807 -0.808869
C  2.629661 -1.041402 0.090866
C  1.604368 -0.546709 -2.083403
C  1.805951 -2.045525 0.588456
C  3.977766 -1.010377 0.407801
C  2.350827 -3.03008 1.399806
C  4.509094 -1.996416 1.228249
C  3.705618 -3.005892 1.720569
C  0.453001 -4.451206 1.386178
C  -0.653051 -4.578673 2.212166
C  0.3806 -4.804049 0.044678
C  -1.841015 -5.069612 1.691294
C  -0.816483 -5.280898 -0.465551
C  -1.929669 -5.41723 0.352024
H  -0.198709 4.404665 -0.471923
H  -1.15785 1.636394 0.491456
H  1.217236 3.49316 2.800679
H  0.506214 5.078325 2.516054
H  1.503619 4.329699 1.275419
H  -1.873148 4.213803 2.975929
H  -1.181061 2.636501 3.34066
H  -2.447664 2.779707 2.126822
H  -2.945857 4.631974 0.357208
H  2.822764 0.771548 -1.032031
H  0.751521 -2.0569 0.341686
H  4.612408 -0.223802 0.020271
H  5.560643 -1.97981 1.480669
H  4.113089 -3.781358 2.355524
H  -0.575322 -4.302807 3.255637
H  1.247756 -4.710095 -0.59688
H  -2.702448 -5.173731 2.337851
H  -0.874478 -5.552039 -1.511228
H  -2.858775 -5.794571 -0.052917
totalener: -2050.65968802 hartree
nucrepener: 2749.59088410 hartree
electener: -4800.25057212 hartree
oneelecener: -8274.78957062 hartree
twoeener: 3474.53899849 hartree
kineticenergy: 2044.53529456 hartree
xcener: -151.870470579340 hartree
chargesum: 0.0000000
charge: -0.023265 -0.040690 -0.271552 -0.376183 -0.295551 -0.002533 0.116847 -0.019798 -0.168778 -0.252308 -0.270402 -0.244106 0.378245 0.091047 0.331128 0.031994 -0.265528 -0.208729 -0.155176 0.250463 -0.084062 -0.211156 0.255525 -0.207595 -0.183506 -0.092564 -0.102710 -0.141708 0.110944 0.105061 0.090160 0.087272 0.101559 0.094171 0.096704 0.088221 0.117613 0.119803 0.131369 0.115487 0.128318 0.128983 0.124887 0.136902 0.126178 0.131950 0.127071
qa: -0.0233 -0.0407 -0.2716 -0.3762 -0.2956 -0.0025 0.1168 -0.0198 -0.1688 -0.2523 -0.2704 -0.2441 0.3782 0.0910 0.3311 0.0320 -0.2655 -0.2087 -0.1552 0.2505 -0.0841 -0.2112 0.2555 -0.2076 -0.1835 -0.0926 -0.1027 -0.1417 0.1109 0.1051 0.0902 0.0873 0.1016 0.0942 0.0967 0.0882 0.1176 0.1198 0.1314 0.1155 0.1283 0.1290 0.1249 0.1369 0.1262 0.1320 0.1271
va: 1.3114 1.2651 2.1344 2.1310 2.1194 3.1191 3.7218 3.8451 3.8773 3.9039 3.9155 3.9062 4.1877 4.2082 3.7759 3.7790 4.0393 3.9735 3.9858 3.8338 3.9570 4.0397 3.7808 4.0479 3.9710 3.9306 3.9431 3.9626 1.0255 1.0231 1.0017 1.0026 1.0195 1.0011 1.0062 1.0006 1.0171 1.0448 1.0218 1.0103 1.0001 1.0125 1.0134 1.0027 0.9989 0.9988 1.0002
dispcorr: -0.023632066 hartree
energy: -2050.683320089417
dipole: 14.11384 -14.10997 0.00387 -8.55414 8.78175 0.22761 26.54552 -24.65978 1.88575
magnitude: 1.89944 au
magnitude: 4.82799 debye
