program: Orca
programVersion: 5.0.2
elementType: Cl Cl O O O N C C C C C C C C C C C C C C C C C C C C C C H H H H H H H H H H H H H H H H H H H
charge: 0
multiplicity: 1
keywords: wb97x-d3
keywords: def2-TZVPP
keywords: def2/J RIJCOSX
keywords: DEFGRID2
keywords: scfconv7
keywords: smallprint printgap noloewdin
keywords: NOSOSCF
formula: C22H19Cl2NO3
InChI: InChI=1/C22H19Cl2NO3/c1-22(2)17(12-19(23)24)20(22)21(26)28-18(13-25)14-7-6-10-16(11-14)27-15-8-4-3-5-9-15/h3-12,17-18,20H,1-2H3
47 atoms
Cl -2.274404 5.281294 -0.272575
Cl -3.886827 4.523776 -2.541028
O  1.450202 0.301345 -0.887241
O  1.204454 1.684179 0.864363
O  1.611153 -4.430789 0.684017
N  4.103793 0.686416 -2.863115
C  -1.813076 0.878665 0.564238
C  -1.597326 2.20853 -0.092805
C  -0.694946 1.040141 -0.447678
C  -1.50603 0.766009 2.037704
C  -2.961099 -0.006094 0.138031
C  -2.496503 2.7362 -1.126394
C  0.725149 1.077936 -0.050956
C  -2.833175 4.010777 -1.283652
C  2.832213 0.159303 -0.640614
C  3.174786 -1.2357 -0.152828
C  3.52822 0.452015 -1.897356
C  2.186206 -2.184626 0.04533
C  4.506285 -1.54579 0.096622
C  2.537329 -3.448751 0.507532
C  4.841962 -2.813118 0.539405
C  3.862379 -3.769935 0.754397
C  0.365803 -4.101944 1.14055
C  0.194476 -3.340799 2.290723
C  -0.730692 -4.596248 0.451463
C  -1.087478 -3.080608 2.747837
C  -2.008775 -4.331325 0.921747
C  -2.193545 -3.570728 2.066418
H  -1.1316 2.953101 0.54267
H  -0.873589 0.569569 -1.40776
H  -0.736976 1.458501 2.369099
H  -1.181561 -0.246456 2.28372
H  -2.410755 0.973624 2.611385
H  -3.884054 0.303696 0.630836
H  -2.759388 -1.040447 0.421411
H  -3.140007 0.005495 -0.936481
H  -2.921185 2.038586 -1.837495
H  3.162164 0.892759 0.103605
H  1.150284 -1.959195 -0.167307
H  5.281688 -0.807389 -0.066344
H  5.878204 -3.058766 0.727817
H  4.117837 -4.760694 1.105476
H  1.054582 -2.964854 2.830007
H  -0.578043 -5.189373 -0.440481
H  -1.220685 -2.499352 3.650961
H  -2.863859 -4.721835 0.386168
H  -3.1913 -3.36971 2.432414
totalener: -2050.66023572 hartree
nucrepener: 2778.57627819 hartree
electener: -4829.23651391 hartree
oneelecener: -8331.92199474 hartree
twoeener: 3502.68548083 hartree
kineticenergy: 2044.52500448 hartree
xcener: -151.872635209027 hartree
chargesum: -0.0000000
charge: -0.037613 -0.043104 -0.287807 -0.365955 -0.298071 -0.000481 0.102429 0.022556 -0.103239 -0.240438 -0.245926 -0.198309 0.343695 0.049808 0.322565 0.064471 -0.251421 -0.150020 -0.214280 0.197220 -0.083285 -0.196322 0.220137 -0.125554 -0.200768 -0.155623 -0.074607 -0.174978 0.088620 0.083093 0.106899 0.072630 0.091044 0.098871 0.087593 0.075981 0.095770 0.136706 0.133454 0.120719 0.128911 0.129511 0.136157 0.130063 0.143761 0.130378 0.134759
qa: -0.0376 -0.0431 -0.2878 -0.3660 -0.2981 -0.0005 0.1024 0.0226 -0.1032 -0.2404 -0.2459 -0.1983 0.3437 0.0498 0.3226 0.0645 -0.2514 -0.1500 -0.2143 0.1972 -0.0833 -0.1963 0.2201 -0.1256 -0.2008 -0.1556 -0.0746 -0.1750 0.0886 0.0831 0.1069 0.0726 0.0910 0.0989 0.0876 0.0760 0.0958 0.1367 0.1335 0.1207 0.1289 0.1295 0.1362 0.1301 0.1438 0.1304 0.1348
va: 1.2902 1.2620 2.0991 2.1432 2.1095 3.1152 3.7176 3.8907 3.8574 3.8986 3.9144 3.9264 4.2245 4.2554 3.7644 3.7090 3.9911 3.9165 4.0574 3.8665 3.9534 4.0400 3.8245 3.9111 4.0378 3.8826 3.8876 3.9032 1.0482 1.0371 1.0240 1.0182 1.0027 1.0031 1.0113 1.0119 1.0325 1.0293 1.0190 1.0126 0.9992 1.0114 1.0037 1.0120 0.9929 0.9970 0.9993
dispcorr: -0.025705640 hartree
energy: -2050.685941359381
dipole: 2.23499 -3.28096 -1.04598 -33.28723 32.00860 -1.27863 18.45126 -17.18513 1.26614
magnitude: 2.08136 au
magnitude: 5.29041 debye
