program: Orca
programVersion: 5.0.2
elementType: Cl Cl O O O N C C C C C C C C C C C C C C C C C C C C C C H H H H H H H H H H H H H H H H H H H
charge: 0
multiplicity: 1
keywords: wb97x-d3
keywords: def2-TZVPP
keywords: def2/J RIJCOSX
keywords: DEFGRID2
keywords: scfconv7
keywords: smallprint printgap noloewdin
keywords: NOSOSCF
formula: C22H19Cl2NO3
InChI: InChI=1/C22H19Cl2NO3/c1-22(2)17(12-19(23)24)20(22)21(26)28-18(13-25)14-7-6-10-16(11-14)27-15-8-4-3-5-9-15/h3-12,17-18,20H,1-2H3
47 atoms
Cl -0.081281 4.518086 -2.698024
Cl -2.206532 6.473284 -2.664186
O  0.374936 0.753283 -0.841806
O  1.502922 2.137371 0.510703
O  -0.288027 -4.283329 0.777702
N  1.505824 -1.119715 -3.328429
C  -1.385111 3.124215 1.231917
C  -0.734147 4.077193 0.287745
C  -0.771935 2.60829 -0.061822
C  -0.727359 2.851766 2.56236
C  -2.893529 3.072102 1.286617
C  -1.520276 5.048168 -0.505027
C  0.492265 1.848355 -0.071278
C  -1.298677 5.310025 -1.786159
C  1.507204 -0.107479 -0.920081
C  1.447392 -1.173875 0.14562
C  1.491493 -0.671014 -2.271496
C  0.634551 -2.287027 -0.019484
C  2.184487 -1.013096 1.311593
C  0.55882 -3.240909 0.984348
C  2.099251 -1.972589 2.308411
C  1.290889 -3.086673 2.156503
C  0.010883 -5.516394 1.287594
C  1.255186 -6.102999 1.092893
C  -0.99336 -6.194631 1.960721
C  1.487258 -7.377458 1.585263
C  -0.750465 -7.473328 2.439614
C  0.489485 -8.067168 2.259846
H  0.246978 4.433351 0.592643
H  -1.485255 2.304934 -0.819162
H  -0.958409 1.843864 2.910741
H  -1.107817 3.553126 3.306752
H  0.353724 2.956642 2.530895
H  -3.355654 3.24331 0.314048
H  -3.279936 3.825385 1.976018
H  -3.228187 2.09728 1.643251
H  -2.303486 5.608828 -0.008082
H  2.431089 0.46829 -0.811628
H  0.06245 -2.433301 -0.927952
H  2.812017 -0.142377 1.443903
H  2.668485 -1.851414 3.220125
H  1.231347 -3.827225 2.943404
H  2.032211 -5.574042 0.555755
H  -1.957612 -5.723207 2.097664
H  2.454923 -7.836322 1.431681
H  -1.535882 -8.003865 2.961338
H  0.676815 -9.063001 2.637691
totalener: -2050.66036853 hartree
nucrepener: 2687.16430617 hartree
electener: -4737.82467470 hartree
oneelecener: -8149.81021743 hartree
twoeener: 3411.98554273 hartree
kineticenergy: 2044.53723645 hartree
xcener: -151.870767138442 hartree
chargesum: 0.0000000
charge: -0.028492 -0.039127 -0.255392 -0.389364 -0.296247 -0.002499 0.113788 -0.021151 -0.158314 -0.253358 -0.270382 -0.241865 0.387791 0.089148 0.330621 -0.001018 -0.263763 -0.184845 -0.135762 0.179476 -0.117279 -0.140971 0.214638 -0.143946 -0.192776 -0.120286 -0.100075 -0.135008 0.109656 0.106152 0.091941 0.086829 0.101532 0.089132 0.093457 0.097066 0.118799 0.122365 0.122448 0.126456 0.130703 0.134739 0.136019 0.126628 0.128854 0.126149 0.127533
qa: -0.0285 -0.0391 -0.2554 -0.3894 -0.2962 -0.0025 0.1138 -0.0212 -0.1583 -0.2534 -0.2704 -0.2419 0.3878 0.0891 0.3306 -0.0010 -0.2638 -0.1848 -0.1358 0.1795 -0.1173 -0.1410 0.2146 -0.1439 -0.1928 -0.1203 -0.1001 -0.1350 0.1097 0.1062 0.0919 0.0868 0.1015 0.0891 0.0935 0.0971 0.1188 0.1224 0.1224 0.1265 0.1307 0.1347 0.1360 0.1266 0.1289 0.1261 0.1275
va: 1.3042 1.2668 2.1274 2.1108 2.1047 3.1162 3.7297 3.8465 3.8870 3.9015 3.9154 3.9028 4.1617 4.2089 3.8021 3.7133 4.0305 4.1025 3.9655 3.9201 3.9649 3.9348 3.8255 3.9435 4.0299 3.9461 3.9413 3.9526 1.0252 1.0252 1.0015 1.0030 1.0201 1.0008 1.0011 1.0063 1.0166 1.0204 1.0290 1.0212 1.0011 1.0037 1.0021 1.0127 0.9998 0.9991 0.9998
dispcorr: -0.023745298 hartree
energy: -2050.684113827178
dipole: -1.15750 0.69502 -0.46248 -28.79456 28.61473 -0.17983 33.23393 -31.04643 2.18751
magnitude: 2.24308 au
magnitude: 5.70146 debye
