program: Orca
programVersion: 5.0.2
elementType: Cl Cl O O O N C C C C C C C C C C C C C C C C C C C C C C H H H H H H H H H H H H H H H H H H H
charge: 0
multiplicity: 1
keywords: wb97x-d3
keywords: def2-TZVPP
keywords: def2/J RIJCOSX
keywords: DEFGRID2
keywords: scfconv7
keywords: smallprint printgap noloewdin
keywords: NOSOSCF
formula: C22H19Cl2NO3
InChI: InChI=1/C22H19Cl2NO3/c1-22(2)17(12-19(23)24)20(22)21(26)28-18(13-25)14-7-6-10-16(11-14)27-15-8-4-3-5-9-15/h3-12,17-18,20H,1-2H3
47 atoms
Cl -0.840248 4.269596 -1.639988
Cl -3.593937 5.113181 -1.420851
O  0.95857 0.307215 -1.149654
O  1.406799 1.580892 0.634884
O  1.59717 -3.971001 1.585166
N  2.681696 -0.95137 -3.672834
C  -1.683818 0.984902 1.122228
C  -1.441237 2.404862 0.732762
C  -0.854723 1.303943 -0.112251
C  -1.02452 0.448861 2.368181
C  -3.033183 0.36661 0.845593
C  -2.515723 3.262152 0.185494
C  0.608533 1.114827 -0.127949
C  -2.340683 4.101497 -0.826333
C  2.333706 -0.007647 -1.259751
C  2.79606 -1.028193 -0.242466
C  2.508217 -0.536405 -2.616043
C  1.921779 -2.015634 0.194662
C  4.104525 -0.990148 0.205482
C  2.37451 -2.970135 1.094734
C  4.546846 -1.958273 1.095987
C  3.691296 -2.945831 1.544073
C  0.254789 -3.973311 1.312419
C  -0.621197 -3.453497 2.252306
C  -0.21619 -4.520336 0.128219
C  -1.98549 -3.483464 2.001941
C  -1.581286 -4.539876 -0.114673
C  -2.468471 -4.021014 0.817992
H  -0.709245 2.931573 1.340493
H  -1.343596 1.093484 -1.056643
H  -0.845271 -0.623186 2.274616
H  -1.681355 0.601879 3.226327
H  -0.075068 0.931176 2.589095
H  -3.724833 0.570695 1.665564
H  -2.940281 -0.716546 0.751282
H  -3.486466 0.741372 -0.072599
H  -3.494174 3.234052 0.650431
H  2.94609 0.89619 -1.167523
H  0.902326 -2.036591 -0.167122
H  4.776703 -0.210919 -0.1303
H  5.567336 -1.935212 1.453687
H  4.02813 -3.697973 2.244866
H  -0.233964 -3.04117 3.175185
H  0.480456 -4.927591 -0.593144
H  -2.671645 -3.085073 2.737739
H  -1.95182 -4.965486 -1.037578
H  -3.532743 -4.044568 0.626304
totalener: -2050.65864919 hartree
nucrepener: 2846.91238487 hartree
electener: -4897.57103406 hartree
oneelecener: -8469.02830945 hartree
twoeener: 3571.45727539 hartree
kineticenergy: 2044.54389361 hartree
xcener: -151.873434632545 hartree
chargesum: -0.0000000
charge: -0.030768 -0.039569 -0.271294 -0.355237 -0.299161 -0.001006 0.139952 -0.024454 -0.148433 -0.234424 -0.279726 -0.242779 0.336923 0.088460 0.296192 0.063038 -0.251260 -0.215032 -0.184312 0.272543 -0.074702 -0.208761 0.248005 -0.183394 -0.168511 -0.165153 -0.109881 -0.109594 0.111023 0.104471 0.059715 0.091021 0.106324 0.094096 0.090869 0.090218 0.118172 0.127684 0.126051 0.104555 0.126116 0.126332 0.139673 0.134037 0.136096 0.132394 0.133490
qa: -0.0308 -0.0396 -0.2713 -0.3552 -0.2992 -0.0010 0.1400 -0.0245 -0.1484 -0.2344 -0.2797 -0.2428 0.3369 0.0885 0.2962 0.0630 -0.2513 -0.2150 -0.1843 0.2725 -0.0747 -0.2088 0.2480 -0.1834 -0.1685 -0.1652 -0.1099 -0.1096 0.1110 0.1045 0.0597 0.0910 0.1063 0.0941 0.0909 0.0902 0.1182 0.1277 0.1261 0.1046 0.1261 0.1263 0.1397 0.1340 0.1361 0.1324 0.1335
va: 1.3018 1.2669 2.1056 2.1491 2.1232 3.1234 3.7023 3.8635 3.8619 3.8822 3.9200 3.9113 4.2092 4.2063 3.8405 3.7210 4.0123 3.9478 4.0670 3.8206 3.9512 4.0419 3.7843 3.9650 3.9908 3.8906 3.9375 3.8964 1.0267 1.0263 1.0195 1.0040 1.0232 1.0002 1.0140 1.0034 1.0165 1.0187 1.0296 1.0129 0.9993 1.0138 1.0025 1.0064 0.9975 0.9982 0.9974
dispcorr: -0.027486536 hartree
energy: -2050.686135727695
dipole: -1.47945 0.42977 -1.04967 -29.70464 29.33177 -0.37286 21.35447 -19.82426 1.53022
magnitude: 1.89272 au
magnitude: 4.81092 debye
