program: Orca
programVersion: 5.0.2
elementType: Cl Cl O O O N C C C C C C C C C C C C C C C C C C C C C C H H H H H H H H H H H H H H H H H H H
charge: 0
multiplicity: 1
keywords: wb97x-d3
keywords: def2-TZVPP
keywords: def2/J RIJCOSX
keywords: DEFGRID2
keywords: scfconv7
keywords: smallprint printgap noloewdin
keywords: NOSOSCF
formula: C22H19Cl2NO3
InChI: InChI=1/C22H19Cl2NO3/c1-22(2)17(12-19(23)24)20(22)21(26)28-18(13-25)14-7-6-10-16(11-14)27-15-8-4-3-5-9-15/h3-12,17-18,20H,1-2H3
47 atoms
Cl -2.115878 -0.010511 -0.768653
Cl -4.25868 0.954871 0.903046
O  2.063429 2.07632 -0.421087
O  2.356278 2.297301 1.783694
O  0.104758 -2.537297 -1.040033
N  4.04211 1.215877 -2.929317
C  -0.195313 4.120889 -0.195283
C  -0.740516 2.728323 -0.118685
C  0.375534 3.161273 0.826125
C  0.572587 4.519631 -1.433929
C  -0.987829 5.270332 0.384032
C  -2.059023 2.398549 0.435133
C  1.691506 2.490624 0.805673
C  -2.716878 1.266855 0.210271
C  3.152441 1.164982 -0.473856
C  2.705314 -0.222754 -0.084061
C  3.636384 1.202033 -1.855214
C  1.608683 -0.783715 -0.723023
C  3.352402 -0.907465 0.932123
C  1.15979 -2.039619 -0.34548
C  2.904431 -2.169456 1.291606
C  1.812567 -2.743428 0.662316
C  -0.744402 -3.438845 -0.458282
C  -1.351738 -3.181136 0.763865
C  -1.034732 -4.595537 -1.164094
C  -2.255718 -4.098212 1.275806
C  -1.949036 -5.500136 -0.644707
C  -2.558729 -5.258267 0.576522
H  -0.414461 2.077201 -0.920476
H  0.073879 3.362861 1.84746
H  1.05187 3.684406 -1.936044
H  1.341761 5.254823 -1.192422
H  -0.110981 4.981871 -2.147795
H  -1.758085 5.598033 -0.315931
H  -0.330007 6.11893 0.575781
H  -1.475281 5.026299 1.327564
H  -2.54089 3.116252 1.087237
H  3.967508 1.492975 0.178759
H  1.092702 -0.258298 -1.517277
H  4.190847 -0.457643 1.446992
H  3.40834 -2.714634 2.078114
H  1.475406 -3.72936 0.953775
H  -1.131425 -2.269023 1.303269
H  -0.554386 -4.775031 -2.116884
H  -2.734629 -3.896591 2.224779
H  -2.181024 -6.399907 -1.198978
H  -3.271053 -5.965384 0.979233
totalener: -2050.65726121 hartree
nucrepener: 2892.50205045 hartree
electener: -4943.15931166 hartree
oneelecener: -8560.34923200 hartree
twoeener: 3617.18992034 hartree
kineticenergy: 2044.54289176 hartree
xcener: -151.873851650943 hartree
chargesum: 0.0000000
charge: -0.041234 -0.045514 -0.279515 -0.340179 -0.298345 0.003272 0.083391 0.018030 -0.053920 -0.235816 -0.271552 -0.197751 0.316896 0.061989 0.299279 0.039662 -0.268879 -0.213861 -0.127719 0.212983 -0.106492 -0.158551 0.254510 -0.173131 -0.207324 -0.117745 -0.094314 -0.137849 0.078930 0.086566 0.096921 0.091573 0.087986 0.102402 0.097394 0.076136 0.100165 0.122030 0.125764 0.109424 0.129066 0.134324 0.131623 0.128082 0.128107 0.126642 0.126545
qa: -0.0412 -0.0455 -0.2795 -0.3402 -0.2983 0.0033 0.0834 0.0180 -0.0539 -0.2358 -0.2716 -0.1978 0.3169 0.0620 0.2993 0.0397 -0.2689 -0.2139 -0.1277 0.2130 -0.1065 -0.1586 0.2545 -0.1731 -0.2073 -0.1177 -0.0943 -0.1378 0.0789 0.0866 0.0969 0.0916 0.0880 0.1024 0.0974 0.0761 0.1002 0.1220 0.1258 0.1094 0.1291 0.1343 0.1316 0.1281 0.1281 0.1266 0.1265
va: 1.3027 1.2604 2.0985 2.1688 2.0836 3.1146 3.7701 3.8272 3.7963 3.9068 3.9279 3.9277 4.2948 4.2340 3.8757 3.6769 4.0167 4.0377 4.0166 3.9110 3.9646 3.9516 3.7214 3.9573 4.0659 3.9723 3.9355 3.9615 1.0391 1.0288 1.0145 1.0031 1.0018 1.0007 1.0037 1.0088 1.0321 1.0183 1.0302 1.0145 1.0010 1.0040 1.0117 1.0128 0.9999 0.9989 0.9999
dispcorr: -0.027152388 hartree
energy: -2050.684413596328
dipole: 9.47939 -10.33627 -0.85688 7.98768 -7.87411 0.11357 3.04616 -1.96357 1.08260
magnitude: 1.38534 au
magnitude: 3.52125 debye
