program: Orca
programVersion: 5.0.2
elementType: Cl Cl O O O N C C C C C C C C C C C C C C C C C C C C C C H H H H H H H H H H H H H H H H H H H
charge: 0
multiplicity: 1
keywords: wb97x-d3
keywords: def2-TZVPP
keywords: def2/J RIJCOSX
keywords: DEFGRID2
keywords: scfconv7
keywords: smallprint printgap noloewdin
keywords: NOSOSCF
formula: C22H19Cl2NO3
InChI: InChI=1/C22H19Cl2NO3/c1-22(2)17(12-19(23)24)20(22)21(26)28-18(13-25)14-7-6-10-16(11-14)27-15-8-4-3-5-9-15/h3-12,17-18,20H,1-2H3
47 atoms
Cl -2.064658 -0.02873 -0.650481
Cl -4.271233 1.017583 0.883938
O  2.051515 2.068699 -0.449007
O  2.333183 2.288409 1.757161
O  0.05436 -2.525601 -1.028006
N  4.030362 1.192817 -2.949067
C  -0.178785 4.143734 -0.246821
C  -0.74561 2.761305 -0.162367
C  0.372857 3.183309 0.784682
C  0.599598 4.522423 -1.485202
C  -0.957224 5.308445 0.320958
C  -2.07436 2.456765 0.383191
C  1.677362 2.489788 0.774623
C  -2.712602 1.303833 0.218526
C  3.136243 1.152371 -0.494912
C  2.685073 -0.233579 -0.102489
C  3.624494 1.184458 -1.874914
C  1.579609 -0.787871 -0.731206
C  3.341402 -0.924375 0.903745
C  1.127803 -2.042396 -0.351094
C  2.893869 -2.186501 1.261813
C  1.791909 -2.753824 0.643729
C  -0.750785 -3.473887 -0.456252
C  -1.352649 -3.261724 0.777194
C  -1.000284 -4.630299 -1.177148
C  -2.208251 -4.225043 1.286825
C  -1.86671 -5.582196 -0.659822
C  -2.469063 -5.386476 0.573205
H  -0.424657 2.097998 -0.956392
H  0.070043 3.396807 1.803235
H  1.381175 5.245199 -1.245966
H  -0.074069 4.992855 -2.20325
H  1.065041 3.67616 -1.981884
H  -1.721983 5.639887 -0.383388
H  -0.289233 6.150417 0.506431
H  -1.449091 5.078834 1.265881
H  -2.582346 3.212464 0.969084
H  3.950675 1.47921 0.159228
H  1.05757 -0.257352 -1.518017
H  4.186629 -0.479315 1.411572
H  3.40498 -2.737471 2.039519
H  1.455593 -3.739591 0.936243
H  -1.16375 -2.349397 1.327914
H  -0.525341 -4.77401 -2.138664
H  -2.681886 -4.05963 2.245379
H  -2.06631 -6.482763 -1.225033
H  -3.142801 -6.1312 0.974581
totalener: -2050.65725639 hartree
nucrepener: 2890.97705498 hartree
electener: -4941.63431137 hartree
oneelecener: -8557.31665210 hartree
twoeener: 3615.68234073 hartree
kineticenergy: 2044.54516393 hartree
xcener: -151.874444548747 hartree
chargesum: 0.0000000
charge: -0.041311 -0.045125 -0.279160 -0.340167 -0.300591 0.002889 0.088499 0.008232 -0.052901 -0.235843 -0.275214 -0.195212 0.316242 0.060405 0.297008 0.043032 -0.268315 -0.215705 -0.129625 0.219379 -0.107685 -0.163841 0.253809 -0.170161 -0.201601 -0.121300 -0.096315 -0.136281 0.081542 0.087602 0.091820 0.087831 0.096724 0.103122 0.097659 0.076109 0.101689 0.122109 0.127276 0.108840 0.128883 0.134326 0.131414 0.127864 0.128467 0.126550 0.127031
qa: -0.0413 -0.0451 -0.2792 -0.3402 -0.3006 0.0029 0.0885 0.0082 -0.0529 -0.2358 -0.2752 -0.1952 0.3162 0.0604 0.2970 0.0430 -0.2683 -0.2157 -0.1296 0.2194 -0.1077 -0.1638 0.2538 -0.1702 -0.2016 -0.1213 -0.0963 -0.1363 0.0815 0.0876 0.0918 0.0878 0.0967 0.1031 0.0977 0.0761 0.1017 0.1221 0.1273 0.1088 0.1289 0.1343 0.1314 0.1279 0.1285 0.1265 0.1270
va: 1.3078 1.2614 2.0984 2.1691 2.0826 3.1146 3.7735 3.8327 3.7944 3.9058 3.9288 3.9212 4.2938 4.2373 3.8775 3.6797 4.0163 4.0374 4.0194 3.9086 3.9676 3.9526 3.7206 3.9624 4.0673 3.9758 3.9362 3.9601 1.0371 1.0285 1.0032 1.0019 1.0144 1.0003 1.0040 1.0081 1.0313 1.0183 1.0299 1.0144 1.0011 1.0043 1.0137 1.0126 0.9999 0.9990 0.9998
dispcorr: -0.027114420 hartree
energy: -2050.684370810827
dipole: 9.68794 -10.54115 -0.85321 7.78529 -7.69308 0.09222 2.42525 -1.37361 1.05165
magnitude: 1.35736 au
magnitude: 3.45014 debye
