program: Gaussian 09
title: 000072602
version: EM64L-G09RevD.01
frameworkgroup: C1[X(C7H15NS3)]
method: RPBEPBE
basis: SDD
operation: Freq
keyword: #p
keyword: freq=noraman
keyword: PBEPBE/SDD
title: #p freq=noraman PBEPBE/SDD
converged: YES YES NO NO
title: Mulliken charges:
elementType: S S S N C C C C C C C H H H H H H H H H H H H H H H
charge: -0.029416 0.115658 0.062631 0.070891 -0.081208 -0.633459 -0.658861 -0.636672 -0.530887 -0.612831 -0.608155 0.228168 0.204804 0.248803 0.229061 0.234844 0.220663 0.254876 0.209203 0.216625 0.228604 0.265158 0.254771 0.257085 0.231834 0.257807
chargesum: 0.00000
title: Mulliken charges with hydrogens summed into heavy atoms:
elementType: S S S N C C C C C C C
charge: -0.029416 0.115658 0.062631 0.070891 -0.081208 0.048317 0.025708 0.044032 -0.530887 0.135703 0.138571
polarizability: 1.99094337e+02 1.82104861e+01 1.43537628e+02 -8.83055273e+00 -3.28188972e+00 1.07141408e+02
1716.lowfreq: -11.7260 0.0006 0.0021 0.0029 4.8050 12.6172 29.5806 36.7082 52.9982
frequency: 29.2050 36.4759 52.9798 87.4051 116.3950 142.4485 147.7637 177.9522 199.4871 228.0725 245.7597 258.3260 270.3702 279.6707 283.8412 291.5590 346.7179 376.6190 382.0167 387.6565 413.4622 435.3356 509.2016 526.3606 555.2286 787.2536 857.6436 926.6921 929.3128 936.4033 954.9800 1015.9797 1021.0249 1048.8703 1087.4722 1130.6204 1141.9545 1156.8295 1220.9138 1232.0943 1239.5264 1371.7863 1377.9252 1389.9807 1400.0722 1427.4821 1447.4683 1452.2141 1456.8368 1460.7343 1463.5279 1470.5544 1472.6563 1475.4290 1476.7661 1492.3724 1512.5694 2969.9361 2973.0981 2977.1955 2981.9650 2989.9558 3063.3575 3067.6564 3072.7890 3074.6008 3077.2311 3084.4965 3089.8408 3096.8046 3112.4353 3120.9478
redmass: 3.8788 4.8498 3.5616 3.9659 1.2140 2.8834 5.6575 1.3933 1.0193 3.3526 3.4408 1.1045 2.9540 2.7567 1.0968 3.7124 3.2338 5.9779 2.5046 3.1116 3.5555 4.5167 3.3093 6.0904 6.1582 3.2646 5.4193 1.5680 1.5550 5.3656 1.2076 1.4802 1.4266 1.5707 1.2242 1.4118 1.7577 1.8869 3.9652 3.0088 3.0219 1.1938 1.2129 1.9489 1.1992 1.1286 1.0471 1.0446 1.1187 1.0484 1.0487 1.0461 1.0510 1.0507 1.0492 1.0525 1.7562 1.0366 1.0358 1.0366 1.0349 1.0351 1.0972 1.0976 1.0969 1.0997 1.1011 1.1012 1.1006 1.1005 1.1019 1.0997
irintensity: 2.3023 0.1175 1.1965 3.0144 0.2882 4.4703 0.9234 0.2284 0.0026 1.3981 3.7763 0.3911 3.7181 5.3702 0.0408 2.0359 1.8227 6.7978 0.6669 3.5076 1.5312 7.9325 7.1081 0.8182 2.8207 0.8875 22.3812 0.5693 3.6904 60.0554 0.2377 4.5725 0.9095 10.5270 2.9974 6.5067 78.4564 124.8573 30.9560 4.6248 8.9288 31.3598 29.7104 51.9866 8.4142 21.9072 0.5989 28.7002 0.0250 3.1425 0.2790 7.3172 8.7562 12.7178 21.6525 15.8880 155.1833 19.1355 18.0267 54.6295 22.0330 60.0677 10.7413 4.6449 63.3493 28.4280 4.2404 5.6475 32.3479 19.4590 7.3815 6.8450
temp: 298.150 k
press: 1.00000 atm
elementType: 16 16 16 7 6 6 6 6 6 6 6 1 1 1 1 1 1 1 1 1 1 1 1 1 1 1
symmnumber: 1
zpe: 552486.7 jmol-1
zpe.correction: 0.210431 hartree
zpe.thermalcorrener: 0.226215 hartree
zpe.thermalcorrenthalpy: 0.227159 hartree
zpe.thermalcorrgfe: 0.166548 hartree
zpe.sumelectzpe: -1523.777126 hartree
zpe.sumelectthermal: -1523.761342 hartree
zpe.sumelectthermalent: -1523.760398 hartree
zpe.sumelectthermalfe: -1523.821009 hartree
dipole: 0.6112 4.0388 2.3343
dipole: 4.7047
quadrupole: -83.9075 -91.0584 -91.8305
quadrupole: -12.1473 0.9973 0.6322
quadrupole: 5.0246 -2.1262 -2.8984 -12.1473 0.9973 0.6322
hfenergy: -1523.9875575 hartree
pointgroup: C01 [X(C7H15N1S3)]
dipole: 0.1035058 0.1990573 -1.8373228 debye
dipolederiv: -0.4618861 0.0689908 0.0028874 0.0840478 -0.3246355 0.0216903 -0.1518639 0.0564792 -0.2552268 0.0459881 -0.0805167 0.1286264 -0.191249 -0.0130298 -0.1299331 0.3277359 -0.0717672 0.1285071 -0.4982337 0.2416413 -0.136673 0.3188657 -0.6115084 0.388568 0.0984562 0.1540191 -0.3543722 -0.5670773 0.0040104 0.2640246 0.0952381 -0.4360981 0.2190897 0.5521538 0.2685177 -0.8679249 0.5427628 0.1322526 0.0684827 0.5713552 0.2306915 0.188296 -0.0356999 0.0624546 0.138448 -0.0958999 0.0019363 0.0295888 -0.1151808 0.0131516 0.0152147 -0.0465194 0.0122399 -0.1343563 -0.1805314 0.0597761 -0.132927 -0.2838021 0.036603 -0.1114503 0.0031938 0.0507767 -0.0188323 -0.1485249 0.0362426 -0.0579478 0.016796 -0.0774715 -0.0381373 0.0064857 -0.0075529 -0.0242004 0.7655678 -0.3265687 -0.286052 -0.3491481 0.5137384 -0.5327534 -0.7452491 -0.4603434 0.7226972 0.3490996 -0.0177556 -0.0648446 -0.1585302 0.0900107 0.176511 -0.021002 0.0224499 0.2346311 0.1372784 0.0056233 0.1343371 0.159995 0.2579414 -0.1984176 0.0264838 -0.1156295 0.1813885 0.0478922 0.068536 0.0584567 0.1336793 -0.0687319 -0.0679778 0.0239178 -0.0222793 0.0649232 -0.0958474 -0.1205128 -0.0000275 -0.1826703 -0.0299661 -0.0204744 0.0050098 -0.0369405 0.0802782 0.0694401 0.0388425 -0.1123192 0.0649824 0.0661453 0.041222 -0.064046 0.0507188 -0.0138193 0.0642683 -0.02795 0.1406536 0.0194723 0.0850844 0.0421568 0.0956381 0.0235672 -0.0749829 0.0940982 0.06437 0.0335046 0.1224549 -0.0679536 -0.0243722 0.053805 -0.0773716 0.0767669 -0.098614 -0.081833 -0.0825776 -0.1373526 -0.0064038 -0.0339588 -0.0984502 0.0042048 0.0579739 0.0341156 0.0731347 -0.0569372 0.0716731 0.0539435 0.0310712 -0.072846 0.0500538 -0.0110926 -0.0456728 -0.1314351 -0.0347811 -0.1614831 -0.0597082 -0.0692789 -0.0365106 -0.0436467 0.0876118 0.0303756 0.0104125 0.1180905 0.0032023 0.0591949 0.0576765 0.1135687 -0.0048321 -0.0753214 0.0601682 0.0272257 -0.0064236 -0.0010919 0.1194335 0.0628953 0.0768518 0.0045028 -0.1332494 0.0679842 -0.0595902 0.0006729 -0.0312954 -0.0275035 -0.0295046 -0.0295322 0.101149 0.1084946 -0.1413248 -0.0142289 0.0137608 -0.0126342 0.0641816 -0.0578957 -0.0855755 -0.0254203 0.0411722 0.0638593 0.0219137 -0.1266693 -0.0586007 0.0321594 0.0110283 -0.0629899 0.024638 -0.0547478 -0.1551229 -0.1131461 0.0812289 -0.02772 0.0607043 0.0761164 0.0511708 0.0548663 0.0751634 0.1158366 0.1186285 0.0238646 0.0489963 0.0400269 -0.0173821 0.0158135 -0.0748543 0.0200702 unknown
polarizability: 185.309877|-27.6904695|132.212503|15.6226126|-24.79669|132.2509928 unknown
InChI: InChI=1S/C7H15NS3/c1-7(2,3)11-10-6(9)8(4)5/h1-5H3
charge 0 multiplicity 1
26 atoms
S  -1.058744 1.705927 0.148462
S  0.279007 0.857056 1.844182
S  2.058916 -1.493576 2.166762
N  2.287231 0.171701 -0.001549
C  -2.338063 0.250999 -0.072114
C  -3.106779 0.046607 1.246259
C  -3.26116 0.785249 -1.193731
C  -1.598732 -1.028195 -0.504771
C  1.651763 -0.172948 1.154402
C  3.291623 -0.74949 -0.579249
C  2.206185 1.503411 -0.642588
H  -3.627004 0.970492 1.553132
H  -3.860947 -0.754433 1.11618
H  -2.422224 -0.256292 2.057882
H  -2.7048 0.956373 -2.132759
H  -3.755883 1.727763 -0.89816
H  -4.04931 0.034151 -1.394267
H  -0.897762 -1.366975 0.278463
H  -2.332718 -1.840006 -0.676972
H  -1.033304 -0.867616 -1.439755
H  3.345726 -0.577717 -1.667502
H  2.997962 -1.79172 -0.377253
H  4.287973 -0.581013 -0.128232
H  1.571319 1.479098 -1.545416
H  3.22797 1.820349 -0.919492
H  1.784255 2.237103 0.059785
