program: Orca
programVersion: 5.0.2
elementType: Cl Cl O O O N C C C C C C C C C C C C C C C C C C C C C C H H H H H H H H H H H H H H H H H H H
charge: 0
multiplicity: 1
keywords: wb97x-d3
keywords: def2-TZVPP
keywords: def2/J RIJCOSX
keywords: DEFGRID2
keywords: scfconv7
keywords: smallprint printgap noloewdin
keywords: NOSOSCF
formula: C22H19Cl2NO3
InChI: InChI=1/C22H19Cl2NO3/c1-22(2)17(12-19(23)24)20(22)21(26)28-18(13-25)14-7-6-10-16(11-14)27-15-8-4-3-5-9-15/h3-12,17-18,20H,1-2H3
47 atoms
Cl -1.993408 5.51108 1.389441
Cl -3.190326 6.326999 -1.104203
O  1.672226 0.956142 -1.334499
O  1.323516 1.768653 0.721176
O  0.049517 -3.550604 -0.039641
N  4.244522 -0.368175 -2.954008
C  -1.650538 1.409722 -0.348174
C  -1.291373 2.854603 -0.139634
C  -0.377448 1.97202 -0.954142
C  -1.584924 0.490079 0.847612
C  -2.740709 1.031277 -1.322006
C  -2.01206 3.947914 -0.803622
C  0.936956 1.591856 -0.39912
C  -2.347454 5.102477 -0.240824
C  2.841716 0.312156 -0.857407
C  2.505686 -0.905987 -0.026108
C  3.609731 -0.061377 -2.047254
C  1.463555 -1.733127 -0.41633
C  3.234452 -1.186887 1.118511
C  1.130455 -2.83169 0.362916
C  2.90753 -2.300187 1.876001
C  1.854431 -3.123776 1.513813
C  -0.066542 -4.861838 0.337669
C  0.906555 -5.791377 -0.004461
C  -1.202944 -5.246399 1.030288
C  0.735084 -7.116936 0.360102
C  -1.367354 -6.578739 1.381261
C  -0.399204 -7.51532 1.0542
H  -0.917396 3.08354 0.851633
H  -0.394803 2.089298 -2.03231
H  -2.550789 0.484768 1.35513
H  -0.833181 0.787745 1.574503
H  -1.366146 -0.534267 0.539453
H  -2.621367 -0.006911 -1.634922
H  -2.744789 1.641379 -2.224488
H  -3.721615 1.126215 -0.853839
H  -2.294286 3.820305 -1.8414
H  3.453207 1.001199 -0.264894
H  0.892158 -1.532402 -1.314156
H  4.039757 -0.534012 1.428727
H  3.465851 -2.520934 2.775619
H  1.596019 -3.974672 2.129759
H  1.786563 -5.481082 -0.55347
H  -1.951642 -4.507815 1.284819
H  1.491881 -7.842999 0.094822
H  -2.255752 -6.881757 1.919128
H  -0.528488 -8.551937 1.333636
totalener: -2050.66023143 hartree
nucrepener: 2714.48702083 hartree
electener: -4765.14725226 hartree
oneelecener: -8204.13156566 hartree
twoeener: 3438.98431340 hartree
kineticenergy: 2044.53875016 hartree
xcener: -151.871959915627 hartree
chargesum: -0.0000000
charge: -0.038871 -0.044942 -0.267789 -0.348396 -0.302647 0.000176 0.069360 0.043226 -0.065082 -0.245821 -0.245954 -0.207143 0.291738 0.051827 0.315410 0.091088 -0.256040 -0.275140 -0.148060 0.238875 -0.109390 -0.156660 0.199790 -0.145120 -0.177861 -0.123749 -0.110147 -0.124426 0.085959 0.083181 0.095955 0.102914 0.082701 0.096662 0.073790 0.099535 0.097595 0.125258 0.127837 0.106050 0.129227 0.135563 0.137701 0.125350 0.129875 0.128144 0.128451
qa: -0.0389 -0.0449 -0.2678 -0.3484 -0.3026 0.0002 0.0694 0.0432 -0.0651 -0.2458 -0.2460 -0.2071 0.2917 0.0518 0.3154 0.0911 -0.2560 -0.2751 -0.1481 0.2389 -0.1094 -0.1567 0.1998 -0.1451 -0.1779 -0.1237 -0.1101 -0.1244 0.0860 0.0832 0.0960 0.1029 0.0827 0.0967 0.0738 0.0995 0.0976 0.1253 0.1278 0.1061 0.1292 0.1356 0.1377 0.1253 0.1299 0.1281 0.1285
va: 1.2884 1.2599 2.1125 2.1535 2.0771 3.1212 3.7719 3.8436 3.8215 3.9093 3.9043 3.9265 4.3153 4.2515 3.8224 3.6214 4.0233 4.0424 4.0420 3.8062 3.9776 3.9486 3.8469 3.9622 4.0235 3.9490 3.9437 3.9439 1.0514 1.0338 1.0030 1.0182 1.0051 1.0042 1.0101 1.0028 1.0305 1.0167 1.0295 1.0131 1.0009 1.0046 1.0026 1.0106 0.9996 0.9994 0.9996
dispcorr: -0.024577380 hartree
energy: -2050.684808810996
dipole: 1.76245 -2.67423 -0.91178 -42.70242 41.43338 -1.26905 4.21235 -3.28799 0.92436
magnitude: 1.81556 au
magnitude: 4.61480 debye
