program: Orca
programVersion: 5.0.2
elementType: Cl Cl O O O N C C C C C C C C C C C C C C C C C C C C C C H H H H H H H H H H H H H H H H H H H
charge: 0
multiplicity: 1
keywords: wb97x-d3
keywords: def2-TZVPP
keywords: def2/J RIJCOSX
keywords: DEFGRID2
keywords: scfconv7
keywords: smallprint printgap noloewdin
keywords: NOSOSCF
formula: C22H19Cl2NO3
InChI: InChI=1/C22H19Cl2NO3/c1-22(2)17(12-19(23)24)20(22)21(26)28-18(13-25)14-7-6-10-16(11-14)27-15-8-4-3-5-9-15/h3-12,17-18,20H,1-2H3
47 atoms
Cl -1.591254 0.410934 -1.457755
Cl -4.405127 0.685358 -0.870193
O  1.57998 1.071963 0.312279
O  1.734115 3.086483 -0.640193
O  1.127883 -3.89275 0.675614
N  2.366141 0.577332 -2.960926
C  -0.765722 3.831559 1.104831
C  -1.270223 3.184199 -0.141037
C  -0.192475 2.497976 0.675959
C  0.040452 5.102221 0.991952
C  -1.630242 3.779295 2.343235
C  -2.609928 2.561805 -0.226568
C  1.129996 2.312346 0.047549
C  -2.832692 1.374146 -0.775169
C  2.73498 0.619125 -0.369005
C  2.991029 -0.793976 0.095401
C  2.517945 0.627754 -1.823427
C  1.918062 -1.675187 0.154965
C  4.265937 -1.206746 0.438107
C  2.126167 -2.97776 0.579178
C  4.46533 -2.52195 0.841965
C  3.40697 -3.406638 0.919939
C  -0.168606 -3.449866 0.584622
C  -0.882167 -3.683451 -0.579453
C  -0.750034 -2.785264 1.654941
C  -2.195393 -3.244384 -0.670645
C  -2.060483 -2.346002 1.549698
C  -2.785542 -2.570991 0.387858
H  -0.911319 3.624619 -1.068311
H  -0.524336 1.644889 1.256285
H  0.732886 5.195074 1.830003
H  -0.63008 5.962465 1.02254
H  0.618677 5.159255 0.074072
H  -2.345826 4.603835 2.346992
H  -1.017395 3.871421 3.24073
H  -2.194051 2.849204 2.423486
H  -3.464334 3.106535 0.157993
H  3.596722 1.25969 -0.153995
H  0.927391 -1.339468 -0.121783
H  5.099612 -0.517548 0.393272
H  5.458332 -2.856538 1.110224
H  3.558959 -4.42758 1.244291
H  -0.409852 -4.199646 -1.405097
H  -0.178209 -2.611286 2.55793
H  -2.754554 -3.419765 -1.580188
H  -2.516802 -1.825127 2.381416
H  -3.803433 -2.215786 0.305401
totalener: -2050.65606801 hartree
nucrepener: 2941.55913638 hartree
electener: -4992.21520439 hartree
oneelecener: -8658.84627136 hartree
twoeener: 3666.63106697 hartree
kineticenergy: 2044.54245623 hartree
xcener: -151.873075770956 hartree
chargesum: 0.0000000
charge: -0.023143 -0.050146 -0.262726 -0.357437 -0.296295 0.000918 0.129492 -0.022252 -0.153542 -0.249737 -0.270166 -0.244301 0.345555 0.108326 0.318712 0.036009 -0.260606 -0.132267 -0.185377 0.235783 -0.073517 -0.213200 0.199998 -0.132393 -0.133830 -0.125408 -0.120730 -0.146603 0.116932 0.101680 0.086506 0.084429 0.105713 0.094991 0.095791 0.085112 0.119815 0.109657 0.076243 0.111635 0.125629 0.126995 0.128071 0.127792 0.127667 0.126264 0.127963
qa: -0.0231 -0.0501 -0.2627 -0.3574 -0.2963 0.0009 0.1295 -0.0223 -0.1535 -0.2497 -0.2702 -0.2443 0.3456 0.1083 0.3187 0.0360 -0.2606 -0.1323 -0.1854 0.2358 -0.0735 -0.2132 0.2000 -0.1324 -0.1338 -0.1254 -0.1207 -0.1466 0.1169 0.1017 0.0865 0.0844 0.1057 0.0950 0.0958 0.0851 0.1198 0.1097 0.0762 0.1116 0.1256 0.1270 0.1281 0.1278 0.1277 0.1263 0.1280
va: 1.3171 1.2572 2.1346 2.1378 2.1193 3.1150 3.7156 3.8576 3.8954 3.8997 3.9121 3.9140 4.1987 4.1612 3.8794 3.7634 3.9716 3.9469 4.0156 3.8632 3.9596 4.0426 3.8476 3.9879 3.9764 3.9190 3.9128 3.8980 1.0214 1.0209 1.0025 1.0020 1.0219 1.0015 1.0067 1.0011 1.0160 1.0180 1.0603 1.0124 0.9999 1.0137 1.0081 1.0046 1.0016 0.9998 1.0104
dispcorr: -0.028498529 hartree
energy: -2050.684566534985
dipole: 8.13231 -8.64434 -0.51203 11.25575 -10.94985 0.30589 18.45952 -16.55272 1.90681
magnitude: 1.99791 au
magnitude: 5.07830 debye
