program: Orca
programVersion: 5.0.2
elementType: Cl Cl O O O N C C C C C C C C C C C C C C C C C C C C C C H H H H H H H H H H H H H H H H H H H
charge: 0
multiplicity: 1
keywords: wb97x-d3
keywords: def2-TZVPP
keywords: def2/J RIJCOSX
keywords: DEFGRID2
keywords: scfconv7
keywords: smallprint printgap noloewdin
keywords: NOSOSCF
formula: C22H19Cl2NO3
InChI: InChI=1/C22H19Cl2NO3/c1-22(2)17(12-19(23)24)20(22)21(26)28-18(13-25)14-7-6-10-16(11-14)27-15-8-4-3-5-9-15/h3-12,17-18,20H,1-2H3
47 atoms
Cl -2.871063 4.19706 1.813913
Cl -4.332074 4.995218 -0.549373
O  1.017281 -0.043418 -1.637455
O  1.712021 1.670949 -0.379864
O  1.365086 -3.637417 2.040529
N  2.437685 -2.307008 -3.582896
C  -1.282033 1.264354 0.631598
C  -1.092433 2.576714 -0.067545
C  -0.63008 1.320449 -0.744018
C  -0.454895 0.977342 1.859923
C  -2.656894 0.6439 0.674329
C  -2.228034 3.338111 -0.633567
C  0.815261 1.051975 -0.879732
C  -3.039715 4.078447 0.109215
C  2.344532 -0.546383 -1.654314
C  2.710288 -1.196668 -0.340235
C  2.381026 -1.525665 -2.743081
C  1.837997 -2.130851 0.208532
C  3.88543 -0.857447 0.304816
C  2.160577 -2.733237 1.415183
C  4.198675 -1.471625 1.510263
C  3.347066 -2.405625 2.066982
C  0.285183 -4.161079 1.379538
C  -0.985705 -3.817283 1.810774
C  0.464948 -5.048282 0.327563
C  -2.090412 -4.377546 1.184835
C  -0.645875 -5.593053 -0.296506
C  -1.924561 -5.259935 0.128382
H  -0.292896 3.192843 0.335931
H  -1.241397 0.926565 -1.549447
H  -0.288084 -0.095424 1.975991
H  -0.987684 1.330506 2.744176
H  0.516612 1.465644 1.844915
H  -3.235501 0.839238 -0.228015
H  -3.225095 1.034855 1.519847
H  -2.579033 -0.438298 0.792958
H  -2.40096 3.319554 -1.703025
H  3.061821 0.247406 -1.887727
H  0.918515 -2.380605 -0.305907
H  4.546503 -0.112592 -0.117789
H  5.114429 -1.212899 2.024295
H  3.585217 -2.883794 3.007817
H  -1.103677 -3.129564 2.638216
H  1.463786 -5.309785 0.001884
H  -3.084562 -4.119669 1.525104
H  -0.509176 -6.283646 -1.117788
H  -2.787808 -5.691822 -0.35934
totalener: -2050.65915473 hartree
nucrepener: 2804.05625553 hartree
electener: -4854.71541026 hartree
oneelecener: -8383.35621287 hartree
twoeener: 3528.64080261 hartree
kineticenergy: 2044.54406073 hartree
xcener: -151.871380918698 hartree
chargesum: -0.0000000
charge: -0.038371 -0.038105 -0.266628 -0.352745 -0.292524 -0.002274 0.083263 -0.045968 -0.085975 -0.239516 -0.243621 -0.197729 0.302508 0.065436 0.329445 0.048256 -0.260125 -0.243486 -0.153977 0.255071 -0.075728 -0.213630 0.235664 -0.188227 -0.162746 -0.116044 -0.111793 -0.122871 0.115466 0.090271 0.076232 0.093689 0.101716 0.084303 0.094005 0.092939 0.119024 0.122161 0.129111 0.106821 0.127049 0.128434 0.128407 0.134158 0.128199 0.131996 0.128460
qa: -0.0384 -0.0381 -0.2666 -0.3527 -0.2925 -0.0023 0.0833 -0.0460 -0.0860 -0.2395 -0.2436 -0.1977 0.3025 0.0654 0.3294 0.0483 -0.2601 -0.2435 -0.1540 0.2551 -0.0757 -0.2136 0.2357 -0.1882 -0.1627 -0.1160 -0.1118 -0.1229 0.1155 0.0903 0.0762 0.0937 0.1017 0.0843 0.0940 0.0929 0.1190 0.1222 0.1291 0.1068 0.1270 0.1284 0.1284 0.1342 0.1282 0.1320 0.1285
va: 1.2911 1.2684 2.1206 2.1526 2.1179 3.1219 3.7612 3.8599 3.8207 3.8997 3.8995 3.8765 4.3144 4.1994 3.8282 3.6789 4.0286 3.9325 4.0333 3.8122 3.9521 4.0443 3.8018 4.0137 3.9855 3.9384 3.9438 3.9478 1.0247 1.0322 1.0072 1.0080 1.0192 1.0033 1.0076 1.0086 1.0150 1.0186 1.0289 1.0149 0.9994 1.0126 1.0101 1.0048 0.9994 0.9991 0.9997
dispcorr: -0.026790072 hartree
energy: -2050.685944805321
dipole: 9.90131 -10.37033 -0.46902 -27.97816 27.87876 -0.09940 5.76806 -5.00190 0.76616
magnitude: 0.90380 au
magnitude: 2.29729 debye
