program: Gaussian 09
title: 000072601
version: EM64L-G09RevD.01
frameworkgroup: C1[X(C10H20N8OP2S)]
method: RPBEPBE
basis: SDD
operation: Freq
keyword: #p
keyword: freq=noraman
keyword: PBEPBE/SDD
title: #p freq=noraman PBEPBE/SDD
converged: YES YES NO NO
title: Mulliken charges:
elementType: S P P O N N N N N N N N C C C C C C C C C C H H H H H H H H H H H H H H H H H H H H
charge: 0.818465 1.040906 1.071659 -0.516815 -0.402547 -0.356265 -0.350957 -0.386589 -0.734978 -0.580657 -0.672827 -0.257436 -0.375771 -0.388423 -0.359395 -0.449456 -0.425536 -0.362827 -0.402754 -0.370888 -0.396028 -0.403409 0.276670 0.248850 0.253369 0.263890 0.267334 0.246543 0.245282 0.301433 0.254187 0.285422 0.252601 0.251024 0.249246 0.283530 0.257170 0.253218 0.255997 0.276056 0.284291 0.256413
chargesum: 0.00000
title: Mulliken charges with hydrogens summed into heavy atoms:
elementType: S P P O N N N N N N N N C C C C C C C C C C
charge: 0.818465 1.040906 1.071659 -0.516815 -0.402547 -0.356265 -0.350957 -0.386589 -0.734978 -0.580657 -0.672827 -0.257436 0.149749 0.128836 0.154482 0.097259 0.114073 0.140799 0.130023 0.139499 0.136024 0.137295
polarizability: 2.65673412e+02 -4.06144493e-01 2.62228998e+02 -1.45595752e+00 1.90228220e+00 2.24325727e+02
1716.lowfreq: -7.1608 0.0008 0.0013 0.0020 6.3392 10.0323 23.5694 35.6159 40.8566
frequency: 21.9887 35.5843 40.6248 42.8037 48.9214 52.5174 63.3672 80.5503 89.9707 100.2716 116.4396 130.0375 135.8004 138.8081 144.4818 175.2293 187.6464 210.3683 216.8367 248.0833 257.7651 274.6203 290.6555 294.9144 300.0888 320.9399 327.3221 349.6905 362.8952 364.2831 381.2265 391.1839 432.5038 459.1047 501.8542 525.2768 582.3787 600.7932 609.2771 610.5658 696.6670 709.7087 738.1812 754.7472 787.0266 791.6926 793.3452 800.7224 805.4363 807.0895 809.4470 810.5589 816.4850 838.1579 864.6876 887.0569 890.0888 897.3974 909.1423 966.1434 993.2874 1000.2756 1001.1917 1002.9202 1005.7808 1068.2479 1070.7293 1073.0008 1078.4201 1079.7009 1105.7083 1110.1756 1111.6023 1113.8774 1120.8324 1121.8006 1124.9874 1130.3964 1136.8443 1147.5644 1150.3440 1153.3869 1153.5931 1153.8579 1158.0167 1205.9706 1236.1678 1237.2014 1242.9191 1245.5979 1429.8907 1443.9766 1447.7831 1449.6301 1450.7480 1453.3929 1463.8795 1464.2816 1473.0911 1479.5008 3058.3238 3065.4260 3078.3489 3078.7979 3082.1161 3082.3400 3082.5952 3086.0779 3087.9316 3089.6030 3178.8103 3183.3810 3186.6966 3190.8710 3192.8379 3198.9541 3199.1995 3204.3665 3208.0641 3209.2635
redmass: 4.7829 3.8071 3.9358 4.2090 3.2792 3.4992 4.0808 3.2930 3.6776 3.4493 4.1818 4.7173 3.7907 2.7895 3.4825 7.3054 4.4455 4.7805 5.4440 5.4264 6.6693 5.1423 5.7194 4.8960 5.3968 5.2983 5.1363 4.9242 5.1539 5.4759 5.3059 5.9343 4.5219 11.5704 12.6524 8.5471 11.4134 12.0209 11.7293 10.4889 13.1532 12.7559 1.5776 8.6725 7.6408 5.8877 8.2380 4.6743 1.1688 2.8337 1.6852 1.2027 1.1175 2.3631 10.5871 4.4784 4.6541 4.5468 5.0475 1.1079 1.0568 1.4240 1.0600 2.4689 1.1459 1.2672 1.2464 1.2791 1.3038 1.2675 1.3308 1.2845 1.3360 1.2966 1.3071 1.3250 1.3166 1.2840 1.2741 1.2932 1.3823 1.3738 1.3936 1.3801 1.3472 3.2884 3.2728 3.3573 3.3817 3.4118 1.0760 1.1723 1.0837 1.0933 1.0755 1.0993 1.1599 1.1683 1.1435 1.1314 1.0563 1.0554 1.0563 1.0520 1.0505 1.0498 1.0557 1.0582 1.0600 1.0589 1.1166 1.1162 1.1180 1.1173 1.1182 1.1177 1.1164 1.1182 1.1169 1.1180
irintensity: 0.1852 1.1438 0.3568 2.7167 0.6656 2.3315 2.4526 2.5130 3.4667 3.0042 3.1071 3.6988 4.9916 1.1522 3.9495 6.3185 1.0013 12.3777 11.2951 8.7028 1.0098 3.6882 14.6358 2.9087 2.6283 1.7180 1.3064 7.0298 4.8431 8.9104 0.1544 7.8455 2.7305 113.3194 3.9770 146.8360 8.6197 20.3689 35.3247 46.7960 46.0166 77.1879 56.4911 5.5661 337.9693 8.6091 54.3183 45.3972 24.6784 7.4159 10.0442 49.8747 40.9136 8.8260 114.1102 65.8172 285.0481 172.7601 24.4744 0.4944 0.5061 171.9972 1.5285 265.1088 20.5806 5.2584 8.7485 8.6281 13.8255 4.4424 15.0101 5.1269 7.4572 3.9728 9.5730 2.6246 9.1520 6.1753 7.7731 6.2410 0.4188 0.3120 0.1063 0.2841 0.9680 9.8150 56.8151 60.1825 59.2458 39.9650 15.2244 7.8249 8.9727 9.1466 8.5629 9.5903 2.3329 2.1347 4.6779 1.0972 16.8191 12.8092 12.2841 24.6372 12.4049 4.0193 23.2117 30.7649 15.7253 25.3826 4.1218 2.2037 2.3251 0.9101 1.4056 9.1719 9.5097 11.8457 1.7150 12.6172
temp: 298.150 k
press: 1.00000 atm
elementType: 16 15 15 8 7 7 7 7 7 7 7 7 6 6 6 6 6 6 6 6 6 6 1 1 1 1 1 1 1 1 1 1 1 1 1 1 1 1 1 1 1 1
symmnumber: 1
zpe: 823784.6 jmol-1
zpe.correction: 0.313763 hartree
zpe.thermalcorrener: 0.339492 hartree
zpe.thermalcorrenthalpy: 0.340436 hartree
zpe.thermalcorrgfe: 0.256549 hartree
zpe.sumelectzpe: -1984.605699 hartree
zpe.sumelectthermal: -1984.579971 hartree
zpe.sumelectthermalent: -1984.579026 hartree
zpe.sumelectthermalfe: -1984.662914 hartree
dipole: -0.8787 1.7137 2.4040
dipole: 3.0803
quadrupole: -139.5822 -146.6665 -149.3873
quadrupole: -1.2693 -0.9372 12.1097
quadrupole: 5.6298 -1.4545 -4.1753 -1.2693 -0.9372 12.1097
hfenergy: -1984.9194624 hartree
pointgroup: C01 [X(C10H20N8O1P2S1)]
dipole: 0.4391289 -0.0044049 1.1295136 debye
polarizability: 263.5257088|4.6478983|256.0304122|7.4698065|-13.9965664|232.6720155 unknown
InChI: InChI=1S/C10H20N8OP2S/c19-22(18-9-10-18)12-20(14-1-2-14,15-3-4-15)11-21(13-22,16-5-6-16)17-7-8-17/h1-10H2
charge 0 multiplicity 1
42 atoms
S  1.158773 -1.350959 -0.245763
P  -1.630349 -0.335437 -0.296569
P  0.609589 1.582405 -0.340787
O  2.14477 -2.016284 -1.370372
N  -2.963032 -0.649073 -1.403903
N  -2.506072 -0.456396 1.25125
N  1.178984 2.295438 -1.862496
N  0.858924 2.93671 0.773552
N  -1.043753 1.250237 -0.502054
N  -0.534676 -1.687683 -0.646102
N  1.628224 0.27415 0.290765
N  1.425174 -2.302446 1.437288
C  -3.873436 0.512677 -1.766325
C  -2.902199 -0.049306 -2.790278
C  -2.850848 -1.841985 1.765762
C  -1.772983 -1.02598 2.455802
C  1.914574 1.402581 -2.84664
C  2.670341 2.469161 -2.074055
C  1.947976 2.852711 1.835556
C  0.484377 2.751685 2.225276
C  2.879202 -2.772827 1.565842
C  1.814176 -3.758747 1.149369
H  -3.632446 1.494583 -1.342521
H  -4.932792 0.243591 -1.801589
H  -3.256163 -0.722749 -3.575406
H  -2.035729 0.5751 -3.040595
H  -2.525706 -2.701532 1.167262
H  -3.854917 -1.908979 2.19491
H  -2.004604 -0.508638 3.391548
H  -0.735183 -1.366843 2.335181
H  1.636291 1.581376 -3.888764
H  2.110451 0.355293 -2.576685
H  3.351642 2.120294 -1.287824
H  2.936006 3.416749 -2.551476
H  2.491148 3.791683 1.977644
H  2.536934 1.929498 1.879528
H  0.112124 1.770288 2.544731
H  -0.03145 3.614445 2.656297
H  3.251663 -2.738746 2.593648
H  3.579973 -2.448498 0.78732
H  1.817643 -4.07403 0.098699
H  1.38298 -4.465415 1.864073
