program: Orca
programVersion: 5.0.2
elementType: Cl Cl O O O N C C C C C C C C C C C C C C C C C C C C C C H H H H H H H H H H H H H H H H H H H
charge: 0
multiplicity: 1
keywords: wb97x-d3
keywords: def2-TZVPP
keywords: def2/J RIJCOSX
keywords: DEFGRID2
keywords: scfconv7
keywords: smallprint printgap noloewdin
keywords: NOSOSCF
formula: C22H19Cl2NO3
InChI: InChI=1/C22H19Cl2NO3/c1-22(2)17(12-19(23)24)20(22)21(26)28-18(13-25)14-7-6-10-16(11-14)27-15-8-4-3-5-9-15/h3-12,17-18,20H,1-2H3
47 atoms
Cl -2.349467 0.020158 -1.021979
Cl -4.134477 0.242298 1.228688
O  1.762146 1.726236 -0.49838
O  2.634149 2.219134 1.501228
O  0.593359 -2.978487 1.032574
N  2.872692 0.593834 -3.397992
C  -0.38255 3.857246 0.375449
C  -0.857853 2.441409 0.242817
C  0.358068 2.749553 1.095051
C  0.215241 4.511668 -0.84658
C  -1.131166 4.827291 1.257399
C  -2.065121 1.902811 0.880187
C  1.701504 2.232503 0.75141
C  -2.75302 0.865344 0.416235
C  2.908739 0.956877 -0.810259
C  2.90473 -0.379111 -0.099348
C  2.872843 0.765308 -2.262506
C  1.711248 -1.068573 0.075146
C  4.098903 -0.900131 0.371838
C  1.725256 -2.287229 0.741251
C  4.10096 -2.125736 1.019395
C  2.920589 -2.822045 1.206841
C  -0.444884 -3.063524 0.148476
C  -1.722526 -3.095807 0.689439
C  -0.254779 -3.18841 -1.22142
C  -2.81443 -3.272543 -0.144163
C  -1.359526 -3.351089 -2.044775
C  -2.63948 -3.400826 -1.51383
H  -0.626953 1.994087 -0.715363
H  0.213509 2.746121 2.169741
H  0.942054 5.273434 -0.558982
H  -0.56925 5.004275 -1.423131
H  0.711937 3.806356 -1.509334
H  -1.986441 5.246404 0.725059
H  -0.4815 5.653854 1.548434
H  -1.501755 4.372178 2.175411
H  -2.411062 2.34648 1.805406
H  3.826508 1.500806 -0.561747
H  0.774877 -0.660647 -0.287381
H  5.022001 -0.349055 0.246595
H  5.029099 -2.537631 1.391618
H  2.91127 -3.772807 1.722921
H  -1.851475 -2.989731 1.758362
H  0.740198 -3.170792 -1.647291
H  -3.808779 -3.293707 0.281037
H  -1.210093 -3.450564 -3.111837
H  -3.493931 -3.531007 -2.163688
totalener: -2050.65599776 hartree
nucrepener: 2953.58661675 hartree
electener: -5004.24261450 hartree
oneelecener: -8682.67079802 hartree
twoeener: 3678.42818351 hartree
kineticenergy: 2044.54216820 hartree
xcener: -151.876035565714 hartree
chargesum: 0.0000000
charge: -0.040932 -0.051602 -0.285029 -0.324746 -0.296060 0.001519 0.064737 0.041584 -0.050826 -0.245185 -0.260114 -0.211370 0.303815 0.076897 0.273243 0.080560 -0.257954 -0.186541 -0.166545 0.246385 -0.078777 -0.212476 0.296310 -0.242798 -0.180756 -0.090763 -0.110478 -0.151489 0.088835 0.086644 0.092989 0.091393 0.094669 0.100030 0.096176 0.074082 0.099498 0.128974 0.110117 0.105918 0.127142 0.128935 0.122929 0.133937 0.122635 0.129981 0.124508
qa: -0.0409 -0.0516 -0.2850 -0.3247 -0.2961 0.0015 0.0647 0.0416 -0.0508 -0.2452 -0.2601 -0.2114 0.3038 0.0769 0.2732 0.0806 -0.2580 -0.1865 -0.1665 0.2464 -0.0788 -0.2125 0.2963 -0.2428 -0.1808 -0.0908 -0.1105 -0.1515 0.0888 0.0866 0.0930 0.0914 0.0947 0.1000 0.0962 0.0741 0.0995 0.1290 0.1101 0.1059 0.1271 0.1289 0.1229 0.1339 0.1226 0.1300 0.1245
va: 1.2972 1.2552 2.0832 2.1822 2.1194 3.1165 3.8025 3.7614 3.7893 3.9125 3.9190 3.9549 4.2916 4.2258 3.8651 3.6504 4.0057 3.9908 4.0436 3.8231 3.9454 4.0419 3.7313 3.9908 3.9401 3.8886 3.9173 3.9276 1.0460 1.0289 1.0015 1.0028 1.0143 1.0015 1.0038 1.0095 1.0317 1.0156 1.0260 1.0129 0.9999 1.0121 1.0167 1.0048 1.0042 0.9996 1.0012
dispcorr: -0.028877393 hartree
energy: -2050.684875148992
dipole: 10.82442 -11.18505 -0.36063 12.93201 -12.29789 0.63412 1.53505 -0.70733 0.82772
magnitude: 1.10330 au
magnitude: 2.80438 debye
