program: Orca
programVersion: 5.0.2
elementType: Cl Cl O O O N C C C C C C C C C C C C C C C C C C C C C C H H H H H H H H H H H H H H H H H H H
charge: 0
multiplicity: 1
keywords: wb97x-d3
keywords: def2-TZVPP
keywords: def2/J RIJCOSX
keywords: DEFGRID2
keywords: scfconv7
keywords: smallprint printgap noloewdin
keywords: NOSOSCF
formula: C22H19Cl2NO3
InChI: InChI=1/C22H19Cl2NO3/c1-22(2)17(12-19(23)24)20(22)21(26)28-18(13-25)14-7-6-10-16(11-14)27-15-8-4-3-5-9-15/h3-12,17-18,20H,1-2H3
47 atoms
Cl -1.128705 6.031578 -0.448981
Cl -3.670871 5.628053 -1.749276
O  0.668523 0.03038 -1.208454
O  1.497931 1.728143 -0.011172
O  1.376552 -3.998618 2.034433
N  1.912339 -2.138733 -3.376363
C  -1.466443 1.825992 1.050231
C  -1.21895 2.934698 0.070769
C  -0.869536 1.510293 -0.308018
C  -0.613671 1.784485 2.295045
C  -2.872563 1.326247 1.282562
C  -2.305872 3.617389 -0.640479
C  0.55231 1.145671 -0.464083
C  -2.352299 4.916994 -0.906949
C  1.983611 -0.489591 -1.350857
C  2.436358 -1.223803 -0.111618
C  1.926242 -1.402618 -2.494978
C  1.662271 -2.275682 0.364865
C  3.600843 -0.850013 0.536826
C  2.078737 -2.972918 1.489247
C  4.002267 -1.549723 1.666486
C  3.253527 -2.609978 2.14159
C  0.502709 -4.722984 1.269184
C  0.893552 -5.303932 0.06943
C  -0.780486 -4.906268 1.759147
C  -0.018915 -6.064884 -0.643552
C  -1.679937 -5.681416 1.042064
C  -1.306695 -6.256453 -0.162657
H  -0.358997 3.552586 0.302021
H  -1.537629 1.00688 -0.997771
H  -0.491297 0.75864 2.647222
H  -1.103639 2.351287 3.088257
H  0.376586 2.20768 2.147988
H  -3.399402 1.977946 1.981105
H  -2.848284 0.32477 1.714016
H  -3.466798 1.268759 0.371292
H  -3.143124 3.02583 -0.989445
H  2.693156 0.3092 -1.589436
H  0.747656 -2.550929 -0.146014
H  4.185873 -0.016222 0.172372
H  4.910678 -1.266352 2.180494
H  3.566571 -3.162149 3.01769
H  1.898511 -5.163441 -0.307769
H  -1.063516 -4.450694 2.698762
H  0.282898 -6.512491 -1.580892
H  -2.680331 -5.828145 1.426738
H  -2.012794 -6.853914 -0.722919
totalener: -2050.66142065 hartree
nucrepener: 2724.98098029 hartree
electener: -4775.64240094 hartree
oneelecener: -8225.27197723 hartree
twoeener: 3449.62957629 hartree
kineticenergy: 2044.54242153 hartree
xcener: -151.872615292108 hartree
chargesum: -0.0000000
charge: -0.038702 -0.044188 -0.269271 -0.367066 -0.295882 -0.003388 0.066404 0.040398 -0.082141 -0.243747 -0.246977 -0.202822 0.334692 0.052207 0.334434 0.025631 -0.260690 -0.214336 -0.143516 0.239840 -0.083646 -0.210235 0.252268 -0.180536 -0.208065 -0.101890 -0.094805 -0.141149 0.086566 0.082944 0.088657 0.090441 0.101941 0.100112 0.094198 0.074193 0.097342 0.121403 0.132253 0.111041 0.128085 0.129404 0.137016 0.125379 0.132255 0.126527 0.127419
qa: -0.0387 -0.0442 -0.2693 -0.3671 -0.2959 -0.0034 0.0664 0.0404 -0.0821 -0.2437 -0.2470 -0.2028 0.3347 0.0522 0.3344 0.0256 -0.2607 -0.2143 -0.1435 0.2398 -0.0836 -0.2102 0.2523 -0.1805 -0.2081 -0.1019 -0.0948 -0.1411 0.0866 0.0829 0.0887 0.0904 0.1019 0.1001 0.0942 0.0742 0.0973 0.1214 0.1323 0.1110 0.1281 0.1294 0.1370 0.1254 0.1323 0.1265 0.1274
va: 1.2888 1.2610 2.1301 2.1396 2.1201 3.1191 3.7656 3.8349 3.8529 3.9136 3.9092 3.9256 4.2619 4.2528 3.8330 3.6602 4.0261 3.9507 4.0141 3.8422 3.9532 4.0359 3.7853 3.9700 4.0469 3.9434 3.9307 3.9607 1.0512 1.0346 1.0024 1.0014 1.0206 1.0021 1.0046 1.0100 1.0311 1.0187 1.0215 1.0163 0.9995 1.0119 1.0027 1.0132 0.9990 0.9990 1.0002
dispcorr: -0.023658014 hartree
energy: -2050.685078660841
dipole: 3.31755 -3.82633 -0.50878 -33.58017 33.23892 -0.34125 17.44547 -16.24677 1.19870
magnitude: 1.34617 au
magnitude: 3.42170 debye
