program: Gaussian 09
title: 000072600
version: EM64L-G09RevD.01
frameworkgroup: C1[X(C12H13NO3S3)]
method: RPBEPBE
basis: SDD
operation: Freq
keyword: #p
keyword: freq=noraman
keyword: PBEPBE/SDD
title: #p freq=noraman PBEPBE/SDD
converged: YES YES NO NO
title: Mulliken charges:
elementType: S S S O O O N C C C C C C C C C C C C H H H H H H H H H H H H H
charge: 0.128828 0.071668 0.075656 -0.239816 -0.433019 -0.245825 0.062486 -0.374852 -0.354573 -0.293463 -0.294249 -0.566330 -0.342928 0.312346 -0.169114 -0.316520 -0.235697 -0.225808 0.135885 0.243531 0.261603 0.251250 0.243290 0.212617 0.233705 0.232078 0.204655 0.273820 0.279022 0.239456 0.239511 0.390787
chargesum: 0.00000
title: Mulliken charges with hydrogens summed into heavy atoms:
elementType: S S S O O O N C C C C C C C C C C C C
charge: 0.128828 0.071668 0.075656 -0.239816 -0.042232 -0.245825 0.062486 0.130281 0.139967 0.152860 0.142484 -0.566330 -0.342928 0.312346 0.104705 -0.037497 0.003759 0.013703 0.135885
polarizability: 3.37231281e+02 4.75984462e+01 1.67920238e+02 -1.56450548e+01 -9.75944208e+00 1.88931588e+02
1716.lowfreq: -25.5015 -7.5689 -5.1705 0.0018 0.0018 0.0022 3.4296 10.1216 24.7976
frequency: -22.1717 8.0326 24.7039 49.4334 58.0267 91.3710 117.5669 129.6365 147.0945 162.1179 189.9386 208.6927 219.9264 257.3088 278.4095 285.9276 325.7703 349.5088 366.9161 397.2649 407.1898 421.3502 432.7194 457.4182 492.4454 508.4753 509.7240 524.8308 579.6090 598.7751 619.6087 656.5754 680.4080 747.1796 759.4003 787.1984 790.9697 814.7933 826.7302 877.8701 893.4879 939.7680 979.3651 1001.7843 1004.7672 1006.4254 1015.5527 1031.0974 1046.1755 1053.5807 1070.4438 1104.2786 1125.0605 1152.6563 1166.5684 1179.1131 1190.0541 1230.3155 1254.7705 1262.9812 1275.4364 1325.7207 1336.1648 1339.6635 1349.5769 1369.2534 1379.8004 1417.7469 1443.8450 1445.1007 1448.2040 1451.1123 1454.3246 1487.6656 1553.5885 1586.6624 1602.4935 2959.9433 2963.1739 2994.6239 3001.5393 3084.0155 3090.7159 3096.0242 3097.9958 3135.7565 3150.5966 3161.7809 3179.3414 3533.6160
redmass: 4.6269 6.4259 6.7623 5.5979 7.3828 8.7244 4.4784 7.0006 4.9513 12.5806 7.7746 7.6350 7.0073 2.6408 3.9792 5.0793 11.0374 10.2561 11.9062 3.2658 2.6584 3.0661 8.1736 3.0129 3.6807 5.4277 5.4241 7.2872 1.2067 5.1764 2.1926 6.4264 4.4101 2.2140 5.9236 4.6647 1.8444 3.7171 1.8143 3.5550 1.3685 3.8394 1.3764 1.8429 2.7184 2.5410 2.4666 4.6237 2.1060 2.3208 4.0570 2.1857 1.6131 4.9060 1.6873 1.0798 1.0638 1.3143 1.3064 1.4778 1.1937 1.2559 2.7870 1.2209 1.3432 1.2586 10.6398 2.0894 1.2822 1.1925 1.1436 2.0844 1.1153 2.3349 6.2497 7.1933 6.5829 1.0682 1.0681 1.0648 1.0622 1.0992 1.0984 1.0960 1.1001 1.0864 1.0908 1.0946 1.0988 1.0644
irintensity: 0.1552 0.2762 0.0187 1.5538 1.5823 2.2942 1.3910 14.0234 3.8701 0.9492 3.8524 37.0878 1.4929 1.9080 19.2160 7.5714 20.2255 2.7362 1.9279 4.8021 5.9772 12.5164 5.7070 0.4956 2.2021 14.2442 4.9566 4.9787 118.3662 65.2818 6.9793 15.1032 45.7184 48.0680 3.2838 15.1269 29.6203 33.0581 2.7075 17.4672 0.2755 75.9803 2.4163 95.2766 170.1731 30.1915 41.3616 41.8981 21.2441 63.0135 24.1280 3.2218 111.9232 8.4366 93.8364 2.9224 1.0804 121.3458 38.9746 12.4118 16.4429 4.7405 158.7735 4.4721 6.4991 1.0924 8.0887 14.3752 67.8374 36.1365 6.8406 93.7954 13.0980 173.2148 30.0044 127.4111 181.7647 27.3986 41.1613 36.7715 55.5071 11.5399 23.8170 26.8152 1.3484 3.0333 0.6801 12.3165 11.2461 98.8662
temp: 298.150 k
press: 1.00000 atm
elementType: 16 16 16 8 8 8 7 6 6 6 6 6 6 6 6 6 6 6 6 1 1 1 1 1 1 1 1 1 1 1 1 1
symmnumber: 1
zpe: 613592.4 jmol-1
zpe.correction: 0.233705 hartree
zpe.thermalcorrener: 0.251808 hartree
zpe.thermalcorrenthalpy: 0.252753 hartree
zpe.thermalcorrgfe: 0.184604 hartree
zpe.sumelectzpe: -1938.271649 hartree
zpe.sumelectthermal: -1938.253546 hartree
zpe.sumelectthermalent: -1938.252602 hartree
zpe.sumelectthermalfe: -1938.320750 hartree
dipole: 1.4623 3.8416 2.1949
dipole: 4.6599
quadrupole: -118.8719 -147.5213 -126.7396
quadrupole: -3.7506 1.1585 -4.9894
quadrupole: 12.1724 -16.4770 4.3046 -3.7506 1.1585 -4.9894
hfenergy: -1938.5053543 hartree
pointgroup: C01 [X(C12H13N1O3S3)]
dipole: -0.2162258 -1.7664431 -0.4404836 debye
polarizability: 303.5682945|49.4726587|179.9266389|66.9394506|6.9638141|210.5881733 unknown
InChI: InChI=1S/C7H5O2S.C5H8NOS2/c8-7(9)5-3-1-2-4-6(5)10;8-5(9)6-1-3-7-4-2-6/h1-4,8H;1-4H2
charge 0 multiplicity 1
32 atoms
S  0.685531 2.357447 0.892745
S  -1.032544 1.604724 -0.63335
S  3.121779 1.944724 2.377768
O  3.192578 -1.909931 -1.37886
O  -4.456237 -0.887623 -2.071245
O  -2.938362 0.850138 -2.292841
N  2.747152 0.587339 0.011719
C  2.157206 0.348133 -1.331844
C  4.015323 -0.171541 0.205766
C  1.934353 -1.162163 -1.541482
C  3.751914 -1.67103 -0.039553
C  2.292773 1.453257 0.952921
C  -1.755652 0.17571 0.277652
C  -2.854463 -0.539961 -0.304348
C  -1.271166 -0.240929 1.542598
C  -3.428434 -1.646002 0.381889
C  -1.852805 -1.338866 2.208726
C  -2.933173 -2.05093 1.631785
C  -3.383856 -0.117716 -1.610518
H  2.876749 0.724827 -2.085023
H  1.208095 0.893181 -1.440423
H  4.385294 0.007091 1.228754
H  4.764355 0.20812 -0.515378
H  1.171464 -1.534527 -0.825022
H  1.599618 -1.362601 -2.571536
H  4.697201 -2.23641 -0.006838
H  3.059714 -2.061341 0.737014
H  -0.451664 0.31152 2.012893
H  -4.265668 -2.166504 -0.091557
H  -1.461007 -1.633572 3.188581
H  -3.380098 -2.901819 2.155115
H  -4.755468 -0.530545 -2.949809
