program: Orca
programVersion: 5.0.2
elementType: Cl Cl O O O N C C C C C C C C C C C C C C C C C C C C C C H H H H H H H H H H H H H H H H H H H
charge: 0
multiplicity: 1
keywords: wb97x-d3
keywords: def2-TZVPP
keywords: def2/J RIJCOSX
keywords: DEFGRID2
keywords: scfconv7
keywords: smallprint printgap noloewdin
keywords: NOSOSCF
formula: C22H19Cl2NO3
InChI: InChI=1/C22H19Cl2NO3/c1-22(2)17(12-19(23)24)20(22)21(26)28-18(13-25)14-7-6-10-16(11-14)27-15-8-4-3-5-9-15/h3-12,17-18,20H,1-2H3
47 atoms
Cl -2.636346 0.234549 -1.211204
Cl -4.322565 0.287063 1.125655
O  1.780831 1.762877 -0.31666
O  2.482341 2.118107 1.77137
O  0.604906 -3.019598 0.92894
N  3.034231 0.749698 -3.190308
C  -0.462712 3.790793 0.466115
C  -0.918802 2.371026 0.304969
C  0.250942 2.686532 1.220549
C  0.187194 4.456492 -0.721617
C  -1.264608 4.748313 1.312815
C  -2.146119 1.834606 0.904649
C  1.610181 2.18754 0.944528
C  -2.921343 0.914299 0.34348
C  2.959808 1.027164 -0.592773
C  2.941095 -0.339078 0.058836
C  2.987776 0.889249 -2.051491
C  1.749464 -1.0522 0.128069
C  4.112701 -0.859687 0.586634
C  1.743904 -2.29677 0.742209
C  4.091547 -2.10982 1.188483
C  2.913262 -2.832362 1.268708
C  -0.391269 -3.058254 -0.009132
C  -0.135772 -3.097192 -1.37405
C  -1.691421 -3.138172 0.470822
C  -1.200825 -3.218211 -2.256356
C  -2.742746 -3.273035 -0.422864
C  -2.503924 -3.312072 -1.789038
H  -0.645247 1.928035 -0.644545
H  0.043949 2.674247 2.284935
H  0.68925 3.759303 -1.389129
H  0.918847 5.197779 -0.395393
H  -0.570586 4.978271 -1.308764
H  -1.657979 4.292054 2.220474
H  -2.108194 5.142773 0.743467
H  -0.645184 5.593845 1.616417
H  -2.432029 2.183433 1.889629
H  3.858867 1.577211 -0.294623
H  0.833136 -0.641274 -0.278339
H  5.032806 -0.291454 0.537132
H  4.999862 -2.523529 1.605847
H  2.893081 -3.803208 1.747347
H  0.876136 -3.044568 -1.755424
H  -1.875521 -3.104722 1.537244
H  -1.001935 -3.248501 -3.319839
H  -3.754771 -3.339288 -0.045043
H  -3.326762 -3.411901 -2.484499
elementType: Cl O N C H
totalener: -2050.68251772 hartree
nucrepener: 2934.66408600 hartree
electener: -4985.34660372 hartree
oneelecener: -8644.99338184 hartree
twoeener: 3659.64677813 hartree
cpcmener: -0.03182740 hartree
kineticenergy: 2044.47865138 hartree
xcener: -151.867659112258 hartree
chargesum: -0.0000000
charge: -0.057329 -0.063943 -0.282888 -0.425728 -0.324920 -0.085383 0.083310 0.046329 -0.069256 -0.258275 -0.270144 -0.220925 0.375475 0.064027 0.373473 0.027495 -0.227978 -0.190452 -0.214280 0.278841 -0.101921 -0.244675 0.324763 -0.210497 -0.271051 -0.130352 -0.120537 -0.192782 0.083794 0.099588 0.094244 0.099528 0.097189 0.091278 0.101794 0.098734 0.130218 0.147290 0.132063 0.144167 0.158079 0.147688 0.153607 0.143961 0.158927 0.152480 0.154974
qa: -0.0573 -0.0639 -0.2829 -0.4257 -0.3249 -0.0854 0.0833 0.0463 -0.0693 -0.2583 -0.2701 -0.2209 0.3755 0.0640 0.3735 0.0275 -0.2280 -0.1905 -0.2143 0.2788 -0.1019 -0.2447 0.3248 -0.2105 -0.2711 -0.1304 -0.1205 -0.1928 0.0838 0.0996 0.0942 0.0995 0.0972 0.0913 0.1018 0.0987 0.1302 0.1473 0.1321 0.1442 0.1581 0.1477 0.1536 0.1440 0.1589 0.1525 0.1550
va: 1.2717 1.2409 2.1082 2.0839 2.0897 3.1072 3.7722 3.8068 3.8278 3.9079 3.9129 3.9187 4.1998 4.1864 3.7616 3.6168 4.0672 3.9668 3.9914 3.7326 3.8873 4.0082 3.6408 3.9137 3.9741 3.8670 3.8443 3.8755 1.0424 1.0279 1.0114 1.0005 1.0003 1.0053 1.0004 1.0014 1.0197 1.0136 1.0147 1.0026 0.9892 1.0058 0.9991 1.0094 0.9893 0.9933 0.9914
dispcorr: -0.028239201 hartree
energy: -2050.710756920141
dipole: 11.93837 -12.18716 -0.24878 11.91520 -10.91469 1.00051 2.20846 -1.24303 0.96544
magnitude: 1.41244 au
magnitude: 3.59014 debye
