program: Orca
programVersion: 5.0.2
elementType: Cl Cl O O O N C C C C C C C C C C C C C C C C C C C C C C H H H H H H H H H H H H H H H H H H H
charge: 0
multiplicity: 1
keywords: wb97x-d3
keywords: def2-TZVPP
keywords: def2/J RIJCOSX
keywords: DEFGRID2
keywords: scfconv7
keywords: smallprint printgap noloewdin
keywords: NOSOSCF
formula: C22H19Cl2NO3
InChI: InChI=1/C22H19Cl2NO3/c1-22(2)17(12-19(23)24)20(22)21(26)28-18(13-25)14-7-6-10-16(11-14)27-15-8-4-3-5-9-15/h3-12,17-18,20H,1-2H3
47 atoms
Cl -3.237465 1.098151 2.164343
Cl -2.847334 3.409102 3.847724
O  2.218711 1.578278 -0.539603
O  0.392361 0.530854 -1.277792
O  1.406079 -4.162573 0.011799
N  2.966914 -0.095178 -3.403618
C  -0.91012 3.37077 -1.009951
C  -1.243904 2.552219 0.199639
C  0.20601 2.686849 -0.24546
C  -1.359184 2.853469 -2.354553
C  -0.925466 4.878527 -0.928485
C  -1.632337 3.157009 1.478154
C  0.893672 1.488156 -0.748395
C  -2.461242 2.621043 2.365047
C  3.010877 0.436778 -0.844401
C  2.687128 -0.737893 0.05186
C  2.950918 0.125052 -2.276591
C  2.189029 -1.933629 -0.440917
C  2.887582 -0.569978 1.41856
C  1.870959 -2.955702 0.444818
C  2.575075 -1.601936 2.287965
C  2.057806 -2.796427 1.809032
C  0.483947 -4.223136 -0.998584
C  -0.56367 -3.315432 -1.104872
C  0.604234 -5.27558 -1.89513
C  -1.488837 -3.469416 -2.127814
C  -0.335134 -5.422217 -2.905924
C  -1.381113 -4.518219 -3.031494
H  -1.687791 1.587736 -0.019093
H  0.828716 3.348058 0.346404
H  -0.660308 3.151992 -3.137975
H  -2.331273 3.284765 -2.600088
H  -1.465605 1.77204 -2.39092
H  -0.351954 5.303195 -1.75403
H  -0.49574 5.265439 -0.005564
H  -1.947127 5.254576 -1.007835
H  -1.201999 4.117406 1.736089
H  4.034534 0.76537 -0.647927
H  2.040497 -2.076424 -1.504463
H  3.284491 0.360531 1.804983
H  2.726936 -1.474821 3.351718
H  1.803967 -3.601359 2.487308
H  -0.667757 -2.497154 -0.403017
H  1.42514 -5.975368 -1.798281
H  -2.303862 -2.76228 -2.212196
H  -0.23985 -6.244819 -3.602913
H  -2.107726 -4.631115 -3.825403
elementType: Cl O N C H
totalener: -2050.68479611 hartree
nucrepener: 2803.26613229 hartree
electener: -4853.95092839 hartree
oneelecener: -8382.84902910 hartree
twoeener: 3528.89810071 hartree
cpcmener: -0.03255756 hartree
kineticenergy: 2044.47870286 hartree
xcener: -151.867392620834 hartree
chargesum: 0.0000000
charge: -0.054409 -0.059678 -0.286427 -0.445431 -0.328977 -0.077969 0.090203 0.020857 -0.075289 -0.267005 -0.269536 -0.201385 0.419771 0.042973 0.481697 -0.025873 -0.255637 -0.161482 -0.253428 0.248857 -0.112812 -0.227468 0.278818 -0.179827 -0.248203 -0.144316 -0.120786 -0.185245 0.086695 0.093938 0.100333 0.097835 0.096593 0.098847 0.091758 0.102655 0.128029 0.145103 0.139316 0.142764 0.158588 0.147896 0.149619 0.145366 0.158243 0.157147 0.157281
qa: -0.0544 -0.0597 -0.2864 -0.4454 -0.3290 -0.0780 0.0902 0.0209 -0.0753 -0.2670 -0.2695 -0.2014 0.4198 0.0430 0.4817 -0.0259 -0.2556 -0.1615 -0.2534 0.2489 -0.1128 -0.2275 0.2788 -0.1798 -0.2482 -0.1443 -0.1208 -0.1852 0.0867 0.0939 0.1003 0.0978 0.0966 0.0988 0.0918 0.1027 0.1280 0.1451 0.1393 0.1428 0.1586 0.1479 0.1496 0.1454 0.1582 0.1571 0.1573
va: 1.2711 1.2451 2.1338 2.0580 2.0818 3.1059 3.7437 3.8807 3.8550 3.9048 3.9081 3.9011 4.1308 4.2157 3.8317 3.6817 4.0855 3.8775 3.9879 3.8051 3.8940 4.0179 3.7027 3.8939 4.0056 3.8977 3.8854 3.9078 1.0407 1.0336 0.9997 0.9999 1.0190 1.0013 1.0060 1.0002 1.0205 0.9912 1.0160 1.0084 0.9890 1.0049 1.0049 1.0082 0.9907 0.9892 0.9905
dispcorr: -0.024377012 hartree
energy: -2050.709173117344
dipole: 8.43509 -7.92590 0.50919 -0.66004 2.45525 1.79521 -22.02624 23.26580 1.23956
magnitude: 2.24021 au
magnitude: 5.69417 debye
