program: Gaussian 09
title: 000072599
version: EM64L-G09RevD.01
frameworkgroup: C1[X(C19H22N2S3)]
method: RPBEPBE
basis: SDD
operation: Freq
keyword: #p
keyword: freq=noraman
keyword: PBEPBE/SDD
title: #p freq=noraman PBEPBE/SDD
converged: YES YES NO NO
title: Mulliken charges:
elementType: S S S N N C C C C C C C C C C C C C C C C C C C H H H H H H H H H H H H H H H H H H H H H H
charge: 0.279704 0.249639 0.072535 -0.099735 -0.162494 -0.343661 -0.329815 -0.330348 -0.632725 0.436806 0.496992 -0.338206 -0.343529 -0.675802 -0.670050 -0.667645 -0.279948 -0.297154 -0.270928 -0.256436 -0.222951 -0.231829 -0.243174 -0.237559 0.228563 0.210715 0.192941 0.208357 0.192068 0.205340 0.269045 0.289708 0.226235 0.208934 0.206831 0.227909 0.214441 0.206167 0.274545 0.287607 0.255003 0.252143 0.236530 0.234851 0.235545 0.234837
chargesum: 0.00000
title: Mulliken charges with hydrogens summed into heavy atoms:
elementType: S S S N N C C C C C C C C C C C C C C C C C C C
charge: 0.279704 0.249639 0.072535 -0.099735 -0.162494 0.095617 0.071483 0.067060 -0.073971 0.436806 0.496992 -0.338206 -0.343529 -0.675802 -0.028051 -0.019128 -0.005403 -0.009547 -0.015926 -0.004293 0.013579 0.003022 -0.007629 -0.002722
polarizability: 3.23086499e+02 5.03022470e+01 2.61760692e+02 -2.92282543e+01 1.28487947e+01 2.49064283e+02
1716.lowfreq: -6.5281 -4.4206 -0.0011 0.0019 0.0022 2.9932 10.7152 16.8817 25.3149
frequency: 10.3598 16.6639 25.2365 32.9536 53.9520 64.9207 67.0541 84.2274 89.5706 102.9447 122.2987 149.6216 155.5210 167.8963 186.1734 213.1689 214.7492 248.7166 253.7118 283.1790 285.8312 308.6171 320.3409 335.4206 358.5160 381.7449 388.5642 401.7782 420.1086 443.1912 444.4670 461.3814 477.0364 493.7385 516.1715 527.7266 581.7842 609.1757 638.4729 647.9375 667.8266 680.0532 715.5438 729.9090 743.3314 755.5423 763.8467 772.1307 791.0420 793.4353 796.9572 860.0791 863.5159 880.0272 909.6461 940.4769 945.7210 981.8514 982.2636 984.1560 986.2323 993.1576 1019.9016 1029.7854 1043.0040 1045.8806 1048.0288 1073.8187 1075.5864 1084.5894 1095.9400 1121.7511 1131.0620 1138.5123 1167.4312 1172.8138 1176.5548 1205.7567 1216.9050 1225.0898 1235.5629 1257.1204 1276.9451 1279.9678 1291.4949 1295.7856 1301.5862 1355.4022 1363.2495 1372.9298 1373.8658 1380.0550 1386.2208 1386.7379 1425.2661 1430.5124 1442.6158 1449.2231 1460.4787 1462.6860 1464.4051 1469.3293 1478.3007 1481.2036 1485.5643 1491.0049 1574.0838 1582.5330 1586.2053 1598.6252 2857.0261 2865.2479 2895.5367 2981.6873 2983.0603 3020.8713 3035.8897 3036.9507 3055.6623 3074.1305 3076.1539 3089.6909 3092.8913 3123.6249 3137.7349 3138.0005 3149.6611 3151.3023 3162.7984 3168.1546 3174.9420 3194.4831
redmass: 4.3395 3.7861 4.3348 6.2903 3.3726 5.1121 4.2273 2.0978 5.7299 4.1148 2.2576 4.5970 3.8684 2.6886 2.1339 2.4530 2.1317 2.3055 4.5907 2.5434 4.2113 3.6525 3.5164 4.5804 8.6650 6.8966 5.6813 4.3709 10.0606 2.8799 3.2223 4.0293 2.7927 7.4817 4.2499 5.0328 6.0781 7.2834 6.3206 5.9351 6.9198 6.7419 4.4919 3.9557 2.6482 1.2682 1.3722 1.2271 3.5964 1.2248 1.1880 1.3537 1.5091 5.1187 1.8857 1.4090 1.4060 2.1891 2.1708 1.3281 2.1988 1.4769 5.2807 2.9244 3.5126 2.7225 3.0657 2.8658 1.8701 2.1167 1.6650 1.6881 1.7179 1.4825 1.8067 1.0777 1.2953 2.2546 1.3640 2.1678 1.6291 1.9478 1.8317 1.1328 1.2307 2.7752 1.2638 1.3234 1.3314 10.3804 1.3526 10.9130 1.2375 1.2335 2.2175 2.2560 1.1195 2.2488 1.0586 1.0571 2.4960 1.0594 1.0581 1.0664 1.0658 1.0758 6.6643 6.4838 7.1420 6.7122 1.0717 1.0715 1.0710 1.0356 1.0357 1.0878 1.0872 1.0575 1.0891 1.0988 1.0980 1.1004 1.1003 1.1095 1.0856 1.0859 1.0904 1.0917 1.0953 1.0986 1.1003 1.0951
irintensity: 0.2638 0.0101 0.6585 0.8839 0.6241 1.7420 0.0363 0.1079 0.5432 0.4419 0.5363 1.2939 0.1359 1.0824 1.5583 0.9752 1.2011 0.3296 0.8848 2.0149 0.5668 1.5690 2.6545 3.3212 1.6170 2.2869 2.2697 3.0250 4.0915 3.2713 0.8805 15.8290 1.2645 2.2071 3.4982 5.2973 6.3079 16.9708 38.5607 14.1055 2.4845 9.0226 1.0541 9.3051 27.6575 23.6114 125.7392 9.1258 14.9511 4.2711 6.7352 1.7572 4.5608 9.8144 1.3102 9.2048 1.0416 64.6333 18.9180 0.0909 75.0559 9.2311 12.5072 2.6005 1.3302 6.0363 20.9790 42.6453 28.6507 2.5293 29.2569 8.5701 9.0061 9.0590 29.8734 1.2828 9.2763 43.2211 15.0564 31.0311 25.3141 146.8869 32.3278 1.6616 20.0567 195.1834 12.7113 8.4413 0.9513 0.7182 3.8089 4.2928 22.7561 17.8158 0.0838 20.4681 36.7268 95.5941 4.0907 5.5514 37.0128 4.8639 1.5740 19.4333 10.2302 9.3133 4.5156 0.1219 1.0431 3.3224 37.0573 185.7514 91.7224 34.3263 22.4641 15.7073 19.2346 4.3020 14.4180 30.7715 83.2346 51.6178 35.7577 8.7898 0.7158 1.6999 7.6442 9.7443 13.2859 25.0905 11.9041 3.5190
temp: 298.150 k
press: 1.00000 atm
elementType: 16 16 16 7 7 6 6 6 6 6 6 6 6 6 6 6 6 6 6 6 6 6 6 6 1 1 1 1 1 1 1 1 1 1 1 1 1 1 1 1 1 1 1 1 1 1
symmnumber: 1
zpe: 957601.9 jmol-1
zpe.correction: 0.364731 hartree
zpe.thermalcorrener: 0.389230 hartree
zpe.thermalcorrenthalpy: 0.390174 hartree
zpe.thermalcorrgfe: 0.307006 hartree
zpe.sumelectzpe: -2039.120815 hartree
zpe.sumelectthermal: -2039.096316 hartree
zpe.sumelectthermalent: -2039.095372 hartree
zpe.sumelectthermalfe: -2039.178541 hartree
dipole: 1.7869 4.1622 0.5475
dipole: 4.5626
quadrupole: -145.7213 -171.5087 -157.3784
quadrupole: -2.8107 -5.9039 -7.2646
quadrupole: 12.4815 -13.3059 0.8244 -2.8107 -5.9039 -7.2646
hfenergy: -2039.4855461 hartree
pointgroup: C01 [X(C19H22N2S3)]
dipole: 0.0713951 -0.5784455 -1.6977907 debye
polarizability: 224.0209403|-5.1341007|276.3215379|34.9251722|-29.4657201|333.5689962 unknown
InChI: InChI=1S/C19H22N2S3/c1-3-20(4-2)13-14-23-19(22)21-15-9-5-7-11-17(15)24-18-12-8-6-10-16(18)21/h5-12H,3-4,13-14H2,1-2H3
charge 0 multiplicity 1
46 atoms
S  -0.463472 2.257173 1.369213
S  -0.430271 -2.392193 -0.09623
S  0.500665 1.138221 3.979115
N  -3.527689 1.597477 -1.363695
N  0.821886 -0.210545 1.57652
C  -2.804488 2.127369 -0.182419
C  -3.229487 2.345358 -2.613582
C  -4.976198 1.361348 -1.128019
C  -1.431435 1.434006 -0.068902
C  1.187938 -0.124256 0.17422
C  1.004948 -1.525605 2.176528
C  0.702198 -1.096958 -0.732482
C  0.440359 -2.642283 1.506214
C  0.364132 0.901964 2.300259
C  -3.389309 1.488708 -3.884358
C  -5.243348 0.118111 -0.257998
C  2.068954 0.883971 -0.282953
C  1.743461 -1.735008 3.365391
C  1.056975 -1.046829 -2.097051
C  0.552569 -3.941104 2.043617
C  2.40931 0.947599 -1.650408
C  1.844496 -3.033981 3.910526
C  1.900285 -0.012143 -2.559202
C  1.239274 -4.134367 3.262812
H  -3.384081 1.918282 0.733588
H  -2.678454 3.235369 -0.233634
H  -3.860211 3.266766 -2.695373
H  -2.180192 2.691268 -2.554044
H  -5.467016 2.256961 -0.670078
H  -5.454975 1.211785 -2.112768
H  -0.8393 1.537626 -0.991789
H  -1.561586 0.366884 0.169159
H  -2.728465 0.605882 -3.831001
H  -4.426398 1.129433 -4.013169
H  -3.126188 2.077978 -4.782749
H  -4.822495 -0.781002 -0.740475
H  -4.785545 0.210343 0.74383
H  -6.330536 -0.028536 -0.116291
H  2.464263 1.613837 0.429311
H  2.207138 -0.882492 3.863539
H  0.680778 -1.810764 -2.784836
H  0.118225 -4.790011 1.505994
H  3.080482 1.737236 -2.003869
H  2.403394 -3.182144 4.840236
H  2.172773 0.033875 -3.618795
H  1.319535 -5.140406 3.687699
