program: Orca
programVersion: 5.0.2
elementType: Cl Cl O O O N C C C C C C C C C C C C C C C C C C C C C C H H H H H H H H H H H H H H H H H H H
charge: 0
multiplicity: 1
keywords: wb97x-d3
keywords: def2-TZVPP
keywords: def2/J RIJCOSX
keywords: DEFGRID2
keywords: scfconv7
keywords: smallprint printgap noloewdin
keywords: NOSOSCF
formula: C22H19Cl2NO3
InChI: InChI=1/C22H19Cl2NO3/c1-22(2)17(12-19(23)24)20(22)21(26)28-18(13-25)14-7-6-10-16(11-14)27-15-8-4-3-5-9-15/h3-12,17-18,20H,1-2H3
47 atoms
Cl -3.263226 0.89319 -1.567019
Cl -4.722832 0.61311 0.907677
O  1.702349 1.511854 -0.401964
O  2.400366 1.89514 1.682129
O  1.006962 -3.367563 0.82063
N  2.989436 0.630933 -3.299583
C  -0.509529 3.565238 0.406256
C  -1.013646 2.161181 0.212487
C  0.1581 2.416069 1.135186
C  0.17214 4.237131 -0.759603
C  -1.29245 4.526116 1.266889
C  -2.276555 1.699732 0.807064
C  1.523692 1.933059 0.85805
C  -3.275087 1.140654 0.135519
C  2.942502 0.891379 -0.699747
C  3.070203 -0.470274 -0.052694
C  2.956042 0.757256 -2.158596
C  1.945954 -1.282871 0.042536
C  4.298504 -0.890843 0.428807
C  2.060943 -2.527287 0.645499
C  4.399298 -2.145442 1.017132
C  3.29036 -2.964339 1.131206
C  -0.16927 -3.113096 0.15584
C  -1.257634 -2.650131 0.877945
C  -0.262882 -3.355333 -1.207195
C  -2.462827 -2.434391 0.222629
C  -1.470286 -3.129038 -1.851779
C  -2.571445 -2.6678 -1.141027
H  -0.770014 1.726907 -0.75002
H  -0.05591 2.382213 2.19804
H  -0.561161 4.808674 -1.331434
H  0.644652 3.539795 -1.448187
H  0.934089 4.937244 -0.41129
H  -0.647644 5.337442 1.609542
H  -1.722606 4.056596 2.150877
H  -2.108345 4.971054 0.69418
H  -2.408743 1.818574 1.876185
H  3.787732 1.527633 -0.416897
H  0.991675 -0.94046 -0.337455
H  5.166414 -0.247991 0.354847
H  5.352512 -2.486079 1.399282
H  3.369105 -3.937686 1.598997
H  -1.164848 -2.465969 1.94104
H  0.596165 -3.718795 -1.758506
H  -3.317467 -2.079359 0.783616
H  -1.549225 -3.316689 -2.914875
H  -3.510973 -2.494188 -1.648536
elementType: Cl O N C H
totalener: -2050.68370959 hartree
nucrepener: 2921.13552963 hartree
electener: -4971.81923922 hartree
oneelecener: -8617.66384869 hartree
twoeener: 3645.84460947 hartree
cpcmener: -0.03189507 hartree
kineticenergy: 2044.47723645 hartree
xcener: -151.866396170245 hartree
chargesum: 0.0000000
charge: -0.057550 -0.062005 -0.279800 -0.427516 -0.325986 -0.085454 0.097091 0.049776 -0.101279 -0.267119 -0.261150 -0.232164 0.390753 0.060276 0.368962 0.005892 -0.228342 -0.187436 -0.225378 0.279843 -0.098262 -0.241331 0.253680 -0.205370 -0.178446 -0.144841 -0.137646 -0.169904 0.092048 0.098957 0.097081 0.095173 0.101707 0.099558 0.089244 0.101146 0.134390 0.147228 0.136114 0.143418 0.157367 0.146565 0.146398 0.153807 0.158021 0.158744 0.153741
qa: -0.0575 -0.0620 -0.2798 -0.4275 -0.3260 -0.0855 0.0971 0.0498 -0.1013 -0.2671 -0.2611 -0.2322 0.3908 0.0603 0.3690 0.0059 -0.2283 -0.1874 -0.2254 0.2798 -0.0983 -0.2413 0.2537 -0.2054 -0.1784 -0.1448 -0.1376 -0.1699 0.0920 0.0990 0.0971 0.0952 0.1017 0.0996 0.0892 0.1011 0.1344 0.1472 0.1361 0.1434 0.1574 0.1466 0.1464 0.1538 0.1580 0.1587 0.1537
va: 1.2637 1.2418 2.1130 2.0832 2.0913 3.1087 3.7459 3.8013 3.8904 3.9146 3.9102 3.8867 4.1715 4.1853 3.7663 3.6664 4.0693 3.9155 3.9981 3.7456 3.8949 4.0014 3.7081 3.9996 3.9578 3.8271 3.8984 3.8557 1.0347 1.0305 1.0010 1.0108 0.9997 1.0018 1.0047 1.0011 1.0141 1.0144 1.0228 1.0028 0.9889 1.0073 1.0056 0.9985 0.9999 0.9894 1.0002
dispcorr: -0.028317441 hartree
energy: -2050.712027034224
dipole: 14.86339 -15.19616 -0.33277 9.66980 -8.71309 0.95672 4.80100 -3.71900 1.08201
magnitude: 1.48216 au
magnitude: 3.76734 debye
