program: Orca
programVersion: 5.0.2
elementType: Cl Cl O O O N C C C C C C C C C C C C C C C C C C C C C C H H H H H H H H H H H H H H H H H H H
charge: 0
multiplicity: 1
keywords: wb97x-d3
keywords: def2-TZVPP
keywords: def2/J RIJCOSX
keywords: DEFGRID2
keywords: scfconv7
keywords: smallprint printgap noloewdin
keywords: NOSOSCF
formula: C22H19Cl2NO3
InChI: InChI=1/C22H19Cl2NO3/c1-22(2)17(12-19(23)24)20(22)21(26)28-18(13-25)14-7-6-10-16(11-14)27-15-8-4-3-5-9-15/h3-12,17-18,20H,1-2H3
47 atoms
Cl -3.946298 3.750078 0.917496
Cl -3.429585 5.951357 -0.873895
O  1.782589 1.011533 -0.221474
O  -0.022174 0.514612 1.013281
O  1.380401 -4.40584 -0.351399
N  4.752123 1.677273 1.063702
C  -1.401578 1.239411 -1.735131
C  -1.671543 2.277227 -0.682514
C  -0.246532 1.847288 -0.959224
C  -1.851979 -0.174444 -1.460056
C  -1.480717 1.611151 -3.195993
C  -2.075649 3.646318 -1.024944
C  0.469836 1.062207 0.061115
C  -3.018675 4.345077 -0.405386
C  2.621907 0.230952 0.629955
C  2.931303 -1.097818 -0.016581
C  3.817454 1.04084 0.863961
C  2.017822 -2.131909 0.167066
C  4.052699 -1.281254 -0.812494
C  2.240525 -3.356517 -0.4459
C  4.26162 -2.512477 -1.418941
C  3.36724 -3.55189 -1.237803
C  0.493867 -4.494751 0.691781
C  0.927753 -4.476191 2.011208
C  -0.846204 -4.673686 0.384511
C  -0.000626 -4.63409 3.029213
C  -1.762785 -4.845237 1.413124
C  -1.345629 -4.821282 2.736186
H  -2.090887 1.883239 0.236327
H  0.375109 2.531666 -1.52566
H  -2.84847 -0.326614 -1.877931
H  -1.906587 -0.41437 -0.400457
H  -1.183109 -0.894492 -1.93603
H  -0.932892 0.884397 -3.798273
H  -1.061626 2.593088 -3.41193
H  -2.51828 1.60745 -3.535028
H  -1.56651 4.136982 -1.845893
H  2.146672 0.072283 1.60206
H  1.143347 -1.973051 0.785113
H  4.76872 -0.4832 -0.96289
H  5.137653 -2.665714 -2.0351
H  3.53508 -4.513223 -1.707121
H  1.977245 -4.34463 2.245137
H  -1.16627 -4.688973 -0.650055
H  0.333935 -4.619398 4.058525
H  -2.808248 -4.992673 1.174122
H  -2.063124 -4.951154 3.535701
elementType: Cl O N C H
totalener: -2050.68629447 hartree
nucrepener: 2730.80473858 hartree
electener: -4781.49103305 hartree
oneelecener: -8236.81917509 hartree
twoeener: 3455.32814204 hartree
cpcmener: -0.02916911 hartree
kineticenergy: 2044.46233727 hartree
xcener: -151.861751893260 hartree
chargesum: 0.0000000
charge: -0.055350 -0.059731 -0.272664 -0.441202 -0.323347 -0.086953 0.094945 0.033373 -0.097266 -0.271659 -0.263979 -0.206082 0.406736 0.042796 0.395878 -0.026990 -0.221878 -0.177992 -0.209835 0.291326 -0.109067 -0.246003 0.278521 -0.196640 -0.237895 -0.137663 -0.125212 -0.175371 0.078721 0.099824 0.100883 0.094834 0.099849 0.099085 0.091385 0.101743 0.129954 0.135455 0.143769 0.138297 0.159317 0.147181 0.157334 0.145891 0.159260 0.157980 0.158442
qa: -0.0553 -0.0597 -0.2727 -0.4412 -0.3233 -0.0870 0.0949 0.0334 -0.0973 -0.2717 -0.2640 -0.2061 0.4067 0.0428 0.3959 -0.0270 -0.2219 -0.1780 -0.2098 0.2913 -0.1091 -0.2460 0.2785 -0.1966 -0.2379 -0.1377 -0.1252 -0.1754 0.0787 0.0998 0.1009 0.0948 0.0998 0.0991 0.0914 0.1017 0.1300 0.1355 0.1438 0.1383 0.1593 0.1472 0.1573 0.1459 0.1593 0.1580 0.1584
va: 1.2700 1.2451 2.1231 2.0729 2.0897 3.1108 3.7367 3.8585 3.8560 3.9092 3.9049 3.8984 4.1924 4.2114 3.7348 3.7695 4.0681 3.8705 3.9881 3.7370 3.9193 4.0207 3.6801 3.9342 4.0082 3.8857 3.8811 3.9025 1.0500 1.0320 1.0013 1.0166 0.9996 1.0014 1.0056 1.0008 1.0181 1.0255 1.0213 1.0129 0.9894 1.0067 0.9963 1.0072 0.9899 0.9892 0.9903
dispcorr: -0.023697908 hartree
energy: -2050.709992382219
dipole: 9.55539 -10.23159 -0.67620 -33.00546 31.56424 -1.44122 -9.34521 8.06022 -1.28499
magnitude: 2.04586 au
magnitude: 5.20017 debye
