program: Orca
programVersion: 5.0.2
elementType: Cl Cl O O O N C C C C C C C C C C C C C C C C C C C C C C H H H H H H H H H H H H H H H H H H H
charge: 0
multiplicity: 1
keywords: wb97x-d3
keywords: def2-TZVPP
keywords: def2/J RIJCOSX
keywords: DEFGRID2
keywords: scfconv7
keywords: smallprint printgap noloewdin
keywords: NOSOSCF
formula: C22H19Cl2NO3
InChI: InChI=1/C22H19Cl2NO3/c1-22(2)17(12-19(23)24)20(22)21(26)28-18(13-25)14-7-6-10-16(11-14)27-15-8-4-3-5-9-15/h3-12,17-18,20H,1-2H3
47 atoms
Cl -0.397119 0.541872 2.410819
Cl -1.969439 2.072706 4.295712
O  1.977426 1.753967 -0.623472
O  0.198155 0.841704 -1.614588
O  0.63784 -3.753414 -0.225182
N  2.844994 0.177862 -3.546147
C  -1.259704 3.492969 -0.705376
C  -1.502097 2.395653 0.266772
C  -0.076199 2.716683 -0.146943
C  -1.701221 3.30374 -2.134583
C  -1.353034 4.921862 -0.228816
C  -1.905719 2.625343 1.670327
C  0.659828 1.682767 -0.886396
C  -1.484505 1.8510 2.660643
C  2.785756 0.635953 -0.973872
C  2.430936 -0.56655 -0.12932
C  2.770997 0.378922 -2.417388
C  1.733576 -1.65094 -0.638975
C  2.757333 -0.5135 1.222227
C  1.327352 -2.664208 0.220515
C  2.368732 -1.544199 2.062216
C  1.639848 -2.61697 1.57065
C  -0.311576 -3.602357 -1.202252
C  -1.209659 -2.540861 -1.200729
C  -0.378457 -4.587484 -2.176529
C  -2.17157 -2.469254 -2.197855
C  -1.354977 -4.508746 -3.159575
C  -2.250209 -3.448542 -3.179611
H  -1.887336 1.473998 -0.16333
H  0.51956 3.256295 0.580027
H  -1.042607 3.838559 -2.821206
H  -2.706811 3.709262 -2.260816
H  -1.731644 2.260232 -2.439752
H  -2.388355 5.267592 -0.253601
H  -0.770114 5.578593 -0.877004
H  -0.982079 5.052922 0.788507
H  -2.59009 3.433389 1.903019
H  3.802062 0.958182 -0.73551
H  1.492892 -1.706407 -1.693241
H  3.307224 0.330824 1.619074
H  2.621049 -1.507456 3.113724
H  1.316783 -3.414146 2.228287
H  -1.166666 -1.775533 -0.434737
H  0.327153 -5.409039 -2.162925
H  -2.867805 -1.64025 -2.201201
H  -1.406129 -5.278717 -3.918849
H  -3.004158 -3.385872 -3.953277
elementType: Cl O N C H
totalener: -2050.68147088 hartree
nucrepener: 2938.53664915 hartree
electener: -4989.21812003 hartree
oneelecener: -8653.53809743 hartree
twoeener: 3664.31997740 hartree
cpcmener: -0.03196794 hartree
kineticenergy: 2044.48472197 hartree
xcener: -151.868750518470 hartree
chargesum: -0.0000000
charge: -0.053501 -0.056626 -0.281550 -0.445355 -0.329539 -0.081620 0.137885 -0.053400 -0.085063 -0.269826 -0.280129 -0.219335 0.380772 0.088546 0.462603 0.009014 -0.247990 -0.165450 -0.267572 0.253303 -0.139916 -0.210149 0.286696 -0.183014 -0.242618 -0.146522 -0.124529 -0.179518 0.119291 0.107376 0.100822 0.096193 0.093639 0.102314 0.099609 0.093547 0.141513 0.142902 0.140774 0.140517 0.158687 0.148008 0.142042 0.145265 0.157107 0.157301 0.157496
qa: -0.0535 -0.0566 -0.2816 -0.4454 -0.3295 -0.0816 0.1379 -0.0534 -0.0851 -0.2698 -0.2801 -0.2193 0.3808 0.0885 0.4626 0.0090 -0.2480 -0.1655 -0.2676 0.2533 -0.1399 -0.2101 0.2867 -0.1830 -0.2426 -0.1465 -0.1245 -0.1795 0.1193 0.1074 0.1008 0.0962 0.0936 0.1023 0.0996 0.0935 0.1415 0.1429 0.1408 0.1405 0.1587 0.1480 0.1420 0.1453 0.1571 0.1573 0.1575
va: 1.3005 1.2505 2.1275 2.0491 2.0852 3.1068 3.7331 3.8869 3.8266 3.8914 3.9092 3.9016 4.1333 4.1772 3.8603 3.5838 4.0698 3.9015 3.9538 3.7945 3.8430 3.9831 3.6869 3.8904 4.0056 3.8986 3.8870 3.9062 1.0178 1.0267 0.9994 1.0011 1.0181 0.9991 1.0029 0.9994 1.0078 0.9928 1.0169 1.0089 0.9904 1.0037 1.0070 1.0079 0.9906 0.9891 0.9903
dispcorr: -0.028395731 hartree
energy: -2050.709866606411
dipole: -5.71966 5.26348 -0.45618 6.57100 -4.79394 1.77707 -21.68666 23.31518 1.62852
magnitude: 2.45319 au
magnitude: 6.23552 debye
