program: Orca
programVersion: 5.0.2
elementType: Cl Cl O O O N C C C C C C C C C C C C C C C C C C C C C C H H H H H H H H H H H H H H H H H H H
charge: 0
multiplicity: 1
keywords: wb97x-d3
keywords: def2-TZVPP
keywords: def2/J RIJCOSX
keywords: DEFGRID2
keywords: scfconv7
keywords: smallprint printgap noloewdin
keywords: NOSOSCF
formula: C22H19Cl2NO3
InChI: InChI=1/C22H19Cl2NO3/c1-22(2)17(12-19(23)24)20(22)21(26)28-18(13-25)14-7-6-10-16(11-14)27-15-8-4-3-5-9-15/h3-12,17-18,20H,1-2H3
47 atoms
Cl -4.217085 3.606778 0.472735
Cl -3.318282 6.253452 -0.241009
O  1.561049 1.138405 0.314414
O  -0.475093 0.218508 0.380952
O  1.361569 -4.555051 -0.55493
N  4.18071 0.932254 2.316153
C  -0.891294 2.041719 -2.138943
C  -1.57546 2.636079 -0.943687
C  -0.114067 2.239305 -0.850322
C  -1.316128 0.661139 -2.575406
C  -0.484925 2.922971 -3.295252
C  -1.917088 4.060713 -0.865339
C  0.255411 1.096484 0.000477
C  -3.002555 4.560459 -0.288543
C  2.072494 0.036974 1.060162
C  2.427252 -1.12016 0.157472
C  3.254847 0.55188 1.753564
C  1.71603 -2.307345 0.268839
C  3.428471 -0.976843 -0.796032
C  2.030001 -3.36953 -0.571739
C  3.721586 -2.041098 -1.633646
C  3.033221 -3.238684 -1.523321
C  0.717822 -4.974176 0.581487
C  1.388757 -5.086887 1.792619
C  -0.613224 -5.343935 0.466919
C  0.705968 -5.567845 2.900009
C  -1.280999 -5.835302 1.580434
C  -0.627881 -5.943094 2.799909
H  -2.256467 1.962256 -0.436628
H  0.611687 3.04444 -0.87178
H  -0.473047 0.108577 -2.994578
H  -2.07362 0.746554 -3.356775
H  -1.745397 0.065343 -1.773291
H  0.267329 2.418071 -3.903679
H  -0.061232 3.876895 -2.983517
H  -1.343556 3.130426 -3.936726
H  -1.228497 4.773459 -1.303441
H  1.362296 -0.282888 1.828704
H  0.926142 -2.392505 1.004669
H  3.98189 -0.050016 -0.885467
H  4.502391 -1.943312 -2.376281
H  3.269428 -4.071324 -2.174023
H  2.431966 -4.806839 1.87451
H  -1.119328 -5.253937 -0.486195
H  1.225156 -5.655096 3.845715
H  -2.319227 -6.128086 1.491288
H  -1.152929 -6.321159 3.667252
elementType: Cl O N C H
totalener: -2050.68706888 hartree
nucrepener: 2700.66029626 hartree
electener: -4751.34736514 hartree
oneelecener: -8176.75162309 hartree
twoeener: 3425.40425796 hartree
cpcmener: -0.03034043 hartree
kineticenergy: 2044.47029121 hartree
xcener: -151.862823757333 hartree
chargesum: 0.0000000
charge: -0.055209 -0.059906 -0.278394 -0.445843 -0.325045 -0.087992 0.087495 0.031675 -0.080468 -0.268705 -0.268451 -0.205201 0.398831 0.044073 0.408306 -0.014143 -0.226703 -0.156611 -0.222100 0.272447 -0.126065 -0.227814 0.263553 -0.187209 -0.228360 -0.142311 -0.129451 -0.174414 0.080329 0.098698 0.100718 0.099106 0.096107 0.098981 0.092409 0.101961 0.129410 0.133801 0.139417 0.145852 0.158603 0.147886 0.158098 0.146819 0.159131 0.157943 0.158748
qa: -0.0552 -0.0599 -0.2784 -0.4458 -0.3250 -0.0880 0.0875 0.0317 -0.0805 -0.2687 -0.2685 -0.2052 0.3988 0.0441 0.4083 -0.0141 -0.2267 -0.1566 -0.2221 0.2724 -0.1261 -0.2278 0.2636 -0.1872 -0.2284 -0.1423 -0.1295 -0.1744 0.0803 0.0987 0.1007 0.0991 0.0961 0.0990 0.0924 0.1020 0.1294 0.1338 0.1394 0.1459 0.1586 0.1479 0.1581 0.1468 0.1591 0.1579 0.1587
va: 1.2703 1.2448 2.1363 2.0668 2.0838 3.1120 3.7381 3.8685 3.8460 3.9066 3.9084 3.9033 4.1928 4.2142 3.7356 3.6457 4.0679 3.8980 3.9887 3.7545 3.9188 4.0099 3.7037 3.9312 4.0105 3.8885 3.8867 3.8996 1.0486 1.0316 0.9989 1.0005 1.0178 1.0011 1.0058 1.0003 1.0193 1.0198 1.0187 1.0084 0.9898 1.0060 0.9960 1.0066 0.9901 0.9895 0.9901
dispcorr: -0.023191816 hartree
energy: -2050.710260696653
dipole: 15.02087 -15.24822 -0.22735 -28.81085 28.18255 -0.62831 -13.34490 11.81445 -1.53045
magnitude: 1.66995 au
magnitude: 4.24468 debye
