program: Orca
programVersion: 5.0.2
elementType: Cl Cl O O O N C C C C C C C C C C C C C C C C C C C C C C H H H H H H H H H H H H H H H H H H H
charge: 0
multiplicity: 1
keywords: wb97x-d3
keywords: def2-TZVPP
keywords: def2/J RIJCOSX
keywords: DEFGRID2
keywords: scfconv7
keywords: smallprint printgap noloewdin
keywords: NOSOSCF
formula: C22H19Cl2NO3
InChI: InChI=1/C22H19Cl2NO3/c1-22(2)17(12-19(23)24)20(22)21(26)28-18(13-25)14-7-6-10-16(11-14)27-15-8-4-3-5-9-15/h3-12,17-18,20H,1-2H3
47 atoms
Cl -3.675494 4.472798 1.108503
Cl -2.860632 6.814571 -0.365715
O  1.808989 1.388015 -0.293024
O  -0.046587 0.827211 0.819412
O  1.604811 -4.197044 1.497517
N  5.059743 1.012266 0.090906
C  -1.310891 2.063939 -1.825999
C  -1.525818 2.970467 -0.647213
C  -0.135888 2.449923 -0.946851
C  -1.897198 0.675867 -1.753526
C  -1.297338 2.629922 -3.225035
C  -1.774894 4.408512 -0.806905
C  0.493027 1.478768 -0.03593
C  -2.649191 5.123839 -0.11058
C  2.539153 0.424443 0.452128
C  2.270845 -0.987244 -0.01452
C  3.947332 0.769643 0.242861
C  2.007269 -1.969476 0.925079
C  2.292681 -1.293753 -1.37053
C  1.786728 -3.276845 0.510901
C  2.057562 -2.599722 -1.769519
C  1.810734 -3.600234 -0.839603
C  0.807146 -5.292996 1.303351
C  1.277842 -6.507853 1.779839
C  -0.45198 -5.195289 0.724025
C  0.475835 -7.636025 1.681807
C  -1.237887 -6.33421 0.622425
C  -0.781492 -7.555928 1.099482
H  -2.016877 2.499196 0.196829
H  0.55642 3.150538 -1.400129
H  -1.994132 0.299615 -0.73724
H  -1.289547 -0.032612 -2.32027
H  -2.895867 0.68021 -2.194255
H  -0.787519 3.590111 -3.293238
H  -2.315429 2.763838 -3.595614
H  -0.785559 1.942821 -3.901389
H  -1.19183 4.943316 -1.547349
H  2.336516 0.516053 1.524639
H  1.977856 -1.72826 1.980971
H  2.495926 -0.530507 -2.111145
H  2.078047 -2.85114 -2.821787
H  1.648022 -4.616711 -1.174458
H  2.260513 -6.565778 2.23111
H  -0.824946 -4.245117 0.362277
H  0.842021 -8.58197 2.059432
H  -2.220036 -6.260078 0.17349
H  -1.403717 -8.437701 1.021708
elementType: Cl O N C H
totalener: -2050.68687335 hartree
nucrepener: 2666.31119827 hartree
electener: -4716.99807162 hartree
oneelecener: -8107.88579980 hartree
twoeener: 3390.88772819 hartree
cpcmener: -0.03191642 hartree
kineticenergy: 2044.46851404 hartree
xcener: -151.862635205781 hartree
chargesum: -0.0000000
charge: -0.054838 -0.059572 -0.278230 -0.434192 -0.324208 -0.087947 0.087986 0.035375 -0.075490 -0.262100 -0.263824 -0.203444 0.371155 0.039068 0.403456 0.032156 -0.225891 -0.231900 -0.229814 0.269457 -0.137326 -0.177682 0.277285 -0.243856 -0.191275 -0.122403 -0.143941 -0.180364 0.079046 0.099274 0.094944 0.096518 0.100732 0.091239 0.102158 0.098614 0.129923 0.141080 0.134721 0.147563 0.160464 0.157305 0.145977 0.158615 0.157020 0.159283 0.157885
qa: -0.0548 -0.0596 -0.2782 -0.4342 -0.3242 -0.0879 0.0880 0.0354 -0.0755 -0.2621 -0.2638 -0.2034 0.3712 0.0391 0.4035 0.0322 -0.2259 -0.2319 -0.2298 0.2695 -0.1373 -0.1777 0.2773 -0.2439 -0.1913 -0.1224 -0.1439 -0.1804 0.0790 0.0993 0.0949 0.0965 0.1007 0.0912 0.1022 0.0986 0.1299 0.1411 0.1347 0.1476 0.1605 0.1573 0.1460 0.1586 0.1570 0.1593 0.1579
va: 1.2706 1.2451 2.1264 2.0809 2.0800 3.1123 3.7459 3.8751 3.8289 3.9053 3.9046 3.8944 4.2284 4.2128 3.7250 3.6061 4.0794 4.0818 3.9660 3.7717 3.9150 3.9154 3.6915 4.0085 3.9182 3.8852 3.8904 3.9027 1.0482 1.0327 1.0173 1.0009 1.0008 1.0054 1.0011 1.0016 1.0184 1.0172 1.0190 1.0125 0.9905 0.9956 1.0079 0.9963 0.9895 0.9903 0.9905
dispcorr: -0.023256064 hartree
energy: -2050.710129414356
dipole: 5.75758 -6.98368 -1.22610 -37.46525 36.29169 -1.17356 -15.41394 13.78902 -1.62492
magnitude: 2.34966 au
magnitude: 5.97237 debye
