program: Orca
programVersion: 5.0.2
elementType: Cl Cl O O O N C C C C C C C C C C C C C C C C C C C C C C H H H H H H H H H H H H H H H H H H H
charge: 0
multiplicity: 1
keywords: wb97x-d3
keywords: def2-TZVPP
keywords: def2/J RIJCOSX
keywords: DEFGRID2
keywords: scfconv7
keywords: smallprint printgap noloewdin
keywords: NOSOSCF
formula: C22H19Cl2NO3
InChI: InChI=1/C22H19Cl2NO3/c1-22(2)17(12-19(23)24)20(22)21(26)28-18(13-25)14-7-6-10-16(11-14)27-15-8-4-3-5-9-15/h3-12,17-18,20H,1-2H3
47 atoms
Cl -1.209375 5.947039 -1.149985
Cl -3.897251 5.223047 -1.901624
O  0.654144 -0.063407 -1.02429
O  1.648264 1.780919 -0.242004
O  1.846263 -4.343117 1.865835
N  1.524995 -2.163062 -3.414762
C  -1.078472 2.16076 1.244606
C  -1.049988 3.025734 0.01931
C  -0.730051 1.545372 -0.097793
C  -0.015393 2.389436 2.291039
C  -2.401055 1.737902 1.835906
C  -2.272043 3.522861 -0.623254
C  0.644705 1.14665 -0.441172
C  -2.427273 4.731259 -1.149531
C  1.929327 -0.615048 -1.350018
C  2.501262 -1.365309 -0.173301
C  1.688566 -1.483427 -2.503555
C  1.884443 -2.537061 0.256486
C  3.590822 -0.845013 0.507421
C  2.367452 -3.18355 1.384438
C  4.068594 -1.509449 1.630021
C  3.461852 -2.669281 2.075133
C  0.608863 -4.768929 1.448212
C  -0.533165 -4.047757 1.76995
C  0.527676 -5.962804 0.749933
C  -1.77141 -4.536327 1.380743
C  -0.718976 -6.446482 0.375406
C  -1.86914 -5.73466 0.684862
H  -0.186205 3.677253 -0.048229
H  -1.502919 0.918218 -0.527139
H  0.902818 2.812696 1.891574
H  0.233933 1.457385 2.801881
H  -0.393726 3.08493 3.042395
H  -2.808038 2.531603 2.464952
H  -2.266321 0.854666 2.462417
H  -3.14925 1.491477 1.083948
H  -3.119185 2.850665 -0.691854
H  2.624113 0.164657 -1.676625
H  1.040157 -2.93806 -0.291802
H  4.063621 0.067906 0.170231
H  4.918669 -1.113105 2.169425
H  3.831915 -3.183633 2.953271
H  -0.4582 -3.118134 2.320928
H  1.429633 -6.511195 0.50844
H  -2.665028 -3.97864 1.629413
H  -0.786571 -7.381418 -0.165616
H  -2.838737 -6.113265 0.38913
elementType: Cl O N C H
totalener: -2050.68677768 hartree
nucrepener: 2719.59899781 hartree
electener: -4770.28577549 hartree
oneelecener: -8214.46457351 hartree
twoeener: 3444.17879802 hartree
cpcmener: -0.03040310 hartree
kineticenergy: 2044.47427112 hartree
xcener: -151.863027216309 hartree
chargesum: -0.0000000
charge: -0.054687 -0.059508 -0.280439 -0.447173 -0.323426 -0.087884 0.088065 0.030895 -0.085711 -0.268946 -0.265205 -0.203391 0.404263 0.042185 0.409008 -0.005909 -0.233093 -0.195641 -0.198085 0.269754 -0.108111 -0.238511 0.242673 -0.182306 -0.203808 -0.148659 -0.139920 -0.161347 0.081938 0.098205 0.096471 0.100679 0.097933 0.101698 0.098742 0.091112 0.129651 0.135723 0.141374 0.143681 0.158814 0.147776 0.157367 0.147357 0.159284 0.158420 0.158693
qa: -0.0547 -0.0595 -0.2804 -0.4472 -0.3234 -0.0879 0.0881 0.0309 -0.0857 -0.2689 -0.2652 -0.2034 0.4043 0.0422 0.4090 -0.0059 -0.2331 -0.1956 -0.1981 0.2698 -0.1081 -0.2385 0.2427 -0.1823 -0.2038 -0.1487 -0.1399 -0.1613 0.0819 0.0982 0.0965 0.1007 0.0979 0.1017 0.0987 0.0911 0.1297 0.1357 0.1414 0.1437 0.1588 0.1478 0.1574 0.1474 0.1593 0.1584 0.1587
va: 1.2711 1.2454 2.1371 2.0651 2.0859 3.1110 3.7292 3.8713 3.8592 3.9034 3.9089 3.9006 4.1806 4.2137 3.7409 3.6732 4.0779 3.9580 3.9543 3.7730 3.9077 4.0072 3.7201 3.9411 4.0003 3.8905 3.8902 3.8913 1.0472 1.0330 1.0185 0.9991 1.0006 1.0009 1.0017 1.0056 1.0188 1.0181 1.0150 1.0111 0.9891 1.0064 0.9966 1.0050 0.9901 0.9896 0.9901
dispcorr: -0.023394790 hartree
energy: -2050.710172473775
dipole: 5.62637 -6.30788 -0.68151 -28.70681 28.40675 -0.30005 22.93663 -20.99443 1.94221
magnitude: 2.08006 au
magnitude: 5.28709 debye
