program: Orca
programVersion: 5.0.2
elementType: Cl Cl O O O N C C C C C C C C C C C C C C C C C C C C C C H H H H H H H H H H H H H H H H H H H
charge: 0
multiplicity: 1
keywords: wb97x-d3
keywords: def2-TZVPP
keywords: def2/J RIJCOSX
keywords: DEFGRID2
keywords: scfconv7
keywords: smallprint printgap noloewdin
keywords: NOSOSCF
formula: C22H19Cl2NO3
InChI: InChI=1/C22H19Cl2NO3/c1-22(2)17(12-19(23)24)20(22)21(26)28-18(13-25)14-7-6-10-16(11-14)27-15-8-4-3-5-9-15/h3-12,17-18,20H,1-2H3
47 atoms
Cl -3.136418 0.976212 -1.916699
Cl -4.80254 0.551254 0.399733
O  1.708097 1.443778 -0.337399
O  2.287594 1.757863 1.793708
O  1.155342 -3.52493 0.598466
N  3.199521 0.812244 -3.201158
C  -0.547077 3.467082 0.455922
C  -1.034203 2.083374 0.124794
C  0.067312 2.264272 1.145272
C  0.214072 4.220922 -0.605821
C  -1.393521 4.362811 1.326596
C  -2.344437 1.598471 0.582727
C  1.454677 1.812349 0.92637
C  -3.291073 1.110723 -0.208551
C  2.986836 0.888216 -0.598083
C  3.136875 -0.506912 -0.030375
C  3.091871 0.854094 -2.058658
C  2.036738 -1.357669 -0.0132
C  4.368189 -0.920875 0.449217
C  2.178158 -2.633893 0.513687
C  4.497678 -2.209196 0.953397
C  3.412497 -3.065433 0.9936
C  -0.096939 -3.142912 0.174546
C  -0.989874 -2.614007 1.094424
C  -0.453314 -3.318726 -1.15407
C  -2.264945 -2.260471 0.674211
C  -1.729756 -2.958226 -1.563367
C  -2.636736 -2.429302 -0.653385
H  -0.721626 1.716874 -0.845967
H  -0.218082 2.155407 2.1862
H  0.741089 3.573539 -1.303877
H  0.943067 4.896707 -0.154232
H  -0.479415 4.828619 -1.189891
H  -0.778756 5.148663 1.769154
H  -1.87895 3.829148 2.143043
H  -2.172136 4.845556 0.732976
H  -2.562881 1.639713 1.643474
H  3.787883 1.534932 -0.224448
H  1.08237 -1.021433 -0.398436
H  5.216739 -0.248438 0.437299
H  5.453911 -2.54601 1.331747
H  3.512391 -4.064366 1.399418
H  -0.692168 -2.484895 2.128086
H  0.258483 -3.731097 -1.859337
H  -2.967612 -1.852446 1.389937
H  -2.014613 -3.091739 -2.599379
H  -3.631096 -2.153256 -0.978574
elementType: Cl O N C H
totalener: -2050.68431139 hartree
nucrepener: 2927.66914050 hartree
electener: -4978.35345189 hartree
oneelecener: -8630.63119740 hartree
twoeener: 3652.27774550 hartree
cpcmener: -0.03198138 hartree
kineticenergy: 2044.46293640 hartree
xcener: -151.864178052607 hartree
chargesum: -0.0000000
charge: -0.056226 -0.059351 -0.278543 -0.428034 -0.325650 -0.085194 0.098287 0.059951 -0.107329 -0.268221 -0.264113 -0.226325 0.394502 0.042082 0.365003 0.006064 -0.228622 -0.194438 -0.231082 0.295571 -0.095783 -0.243284 0.229243 -0.171813 -0.167106 -0.160546 -0.158804 -0.134961 0.090468 0.099852 0.094894 0.102523 0.097423 0.100115 0.089392 0.101593 0.136120 0.147200 0.132578 0.143230 0.157199 0.146138 0.150526 0.150105 0.150223 0.157860 0.147288
qa: -0.0562 -0.0594 -0.2785 -0.4280 -0.3256 -0.0852 0.0983 0.0600 -0.1073 -0.2682 -0.2641 -0.2263 0.3945 0.0421 0.3650 0.0061 -0.2286 -0.1944 -0.2311 0.2956 -0.0958 -0.2433 0.2292 -0.1718 -0.1671 -0.1605 -0.1588 -0.1350 0.0905 0.0999 0.0949 0.1025 0.0974 0.1001 0.0894 0.1016 0.1361 0.1472 0.1326 0.1432 0.1572 0.1461 0.1505 0.1501 0.1502 0.1579 0.1473
va: 1.2661 1.2453 2.1130 2.0829 2.0956 3.1095 3.7492 3.7823 3.8972 3.9140 3.9100 3.8547 4.1651 4.1926 3.7634 3.6805 4.0675 3.9198 4.0046 3.7407 3.8935 4.0051 3.7313 3.9832 3.9560 3.8303 3.9349 3.8036 1.0368 1.0302 1.0109 0.9996 1.0010 1.0018 1.0047 1.0011 1.0136 1.0152 1.0273 1.0029 0.9889 1.0079 1.0010 1.0005 0.9997 0.9911 1.0092
dispcorr: -0.028833071 hartree
energy: -2050.713144460559
dipole: 14.29882 -14.79006 -0.49124 9.52725 -8.62554 0.90170 8.39365 -7.10465 1.28900
magnitude: 1.64800 au
magnitude: 4.18888 debye
