program: Orca
programVersion: 5.0.2
elementType: Cl Cl O O O N C C C C C C C C C C C C C C C C C C C C C C H H H H H H H H H H H H H H H H H H H
charge: 0
multiplicity: 1
keywords: wb97x-d3
keywords: def2-TZVPP
keywords: def2/J RIJCOSX
keywords: DEFGRID2
keywords: scfconv7
keywords: smallprint printgap noloewdin
keywords: NOSOSCF
formula: C22H19Cl2NO3
InChI: InChI=1/C22H19Cl2NO3/c1-22(2)17(12-19(23)24)20(22)21(26)28-18(13-25)14-7-6-10-16(11-14)27-15-8-4-3-5-9-15/h3-12,17-18,20H,1-2H3
47 atoms
Cl -0.795562 2.015719 -3.695816
Cl -3.576771 2.770771 -3.811128
O  1.133193 1.471283 0.520712
O  -0.326785 0.500639 1.901368
O  1.038627 -4.36172 0.751938
N  4.372323 1.349215 -0.062959
C  -0.793321 3.862733 0.512742
C  -0.926829 3.030964 -0.725786
C  -1.041368 2.372921 0.644589
C  0.556204 4.465673 0.820426
C  -1.936135 4.746099 0.955005
C  -2.112852 3.07063 -1.589761
C  -0.069086 1.363813 1.101251
C  -2.147757 2.671046 -2.854748
C  2.074679 0.437805 0.782015
C  1.708206 -0.833068 0.052796
C  3.355693 0.965033 0.307749
C  1.571758 -2.009572 0.771853
C  1.469435 -0.802026 -1.316788
C  1.16866 -3.165095 0.113573
C  1.084271 -1.966193 -1.961296
C  0.921574 -3.146907 -1.251629
C  0.546027 -4.430848 2.027118
C  1.082209 -5.413864 2.847475
C  -0.480717 -3.610549 2.480493
C  0.585772 -5.576592 4.132694
C  -0.957356 -3.777302 3.773232
C  -0.430214 -4.756469 4.60429
H  0.007578 2.840508 -1.240105
H  -2.04526 2.116567 0.963453
H  1.38798 3.926789 0.373799
H  0.722449 4.515571 1.897975
H  0.590862 5.486455 0.436066
H  -1.94808 5.67311 0.378785
H  -1.818119 5.011791 2.006753
H  -2.912483 4.273932 0.851749
H  -3.040102 3.445521 -1.173689
H  2.173087 0.250489 1.856025
H  1.768938 -2.015567 1.836821
H  1.576239 0.118062 -1.878386
H  0.893082 -1.954576 -3.026162
H  0.604816 -4.052229 -1.754095
H  1.878185 -6.048776 2.478142
H  -0.910224 -2.847113 1.843694
H  1.004476 -6.345798 4.768947
H  -1.753401 -3.135227 4.128007
H  -0.809883 -4.880649 5.609908
elementType: Cl O N C H
totalener: -2050.68350125 hartree
nucrepener: 2781.30122804 hartree
electener: -4831.98472930 hartree
oneelecener: -8337.87210233 hartree
twoeener: 3505.88737303 hartree
cpcmener: -0.03118143 hartree
kineticenergy: 2044.46958878 hartree
xcener: -151.864015049217 hartree
chargesum: -0.0000000
charge: -0.057420 -0.058804 -0.273986 -0.437699 -0.326410 -0.085088 0.093024 0.012895 -0.062001 -0.258024 -0.285821 -0.197382 0.394108 0.046419 0.375515 0.020621 -0.228507 -0.198022 -0.214478 0.286222 -0.130452 -0.222226 0.299969 -0.257963 -0.200296 -0.116319 -0.139529 -0.191119 0.088952 0.099775 0.092607 0.101183 0.096389 0.104845 0.100192 0.093243 0.127014 0.139006 0.146066 0.144856 0.156537 0.148473 0.145605 0.153109 0.157853 0.159356 0.157709
qa: -0.0574 -0.0588 -0.2740 -0.4377 -0.3264 -0.0851 0.0930 0.0129 -0.0620 -0.2580 -0.2858 -0.1974 0.3941 0.0464 0.3755 0.0206 -0.2285 -0.1980 -0.2145 0.2862 -0.1305 -0.2222 0.3000 -0.2580 -0.2003 -0.1163 -0.1395 -0.1911 0.0890 0.0998 0.0926 0.1012 0.0964 0.1048 0.1002 0.0932 0.1270 0.1390 0.1461 0.1449 0.1565 0.1485 0.1456 0.1531 0.1579 0.1594 0.1577
va: 1.2722 1.2464 2.1262 2.0727 2.0872 3.1069 3.7728 3.8520 3.8177 3.9051 3.9207 3.8843 4.1869 4.2154 3.7790 3.5993 4.0667 3.9396 3.9623 3.7292 3.9260 4.0142 3.6851 4.0121 3.9058 3.8813 3.8903 3.9120 1.0344 1.0262 1.0106 1.0003 1.0002 0.9992 1.0006 1.0052 1.0226 1.0175 1.0059 1.0111 0.9915 1.0048 1.0086 1.0036 0.9890 0.9904 0.9906
dispcorr: -0.025080189 hartree
energy: -2050.708581441929
dipole: 3.60219 -5.03775 -1.43556 -0.70983 1.44046 0.73063 29.25142 -28.25585 0.99557
magnitude: 1.89362 au
magnitude: 4.81321 debye
