program: Orca
programVersion: 5.0.2
elementType: Cl Cl O O O N C C C C C C C C C C C C C C C C C C C C C C H H H H H H H H H H H H H H H H H H H
charge: 0
multiplicity: 1
keywords: wb97x-d3
keywords: def2-TZVPP
keywords: def2/J RIJCOSX
keywords: DEFGRID2
keywords: scfconv7
keywords: smallprint printgap noloewdin
keywords: NOSOSCF
formula: C22H19Cl2NO3
InChI: InChI=1/C22H19Cl2NO3/c1-22(2)17(12-19(23)24)20(22)21(26)28-18(13-25)14-7-6-10-16(11-14)27-15-8-4-3-5-9-15/h3-12,17-18,20H,1-2H3
47 atoms
Cl -0.946088 1.811236 -3.522773
Cl -3.716421 2.607707 -3.446601
O  1.345882 1.491371 0.582729
O  -0.068177 0.524107 2.013316
O  0.867399 -4.268138 0.519901
N  4.579773 1.349284 -0.039415
C  -0.56144 3.88164 0.564481
C  -0.811931 2.990922 -0.613006
C  -0.81847 2.406402 0.796523
C  0.816365 4.480625 0.718537
C  -1.651158 4.805546 1.056041
C  -2.065806 3.006039 -1.376111
C  0.166171 1.390935 1.209573
C  -2.211568 2.541511 -2.611293
C  2.27482 0.429991 0.775485
C  1.866747 -0.788364 -0.017292
C  3.55943 0.959501 0.314714
C  1.596363 -1.971603 0.651573
C  1.704825 -0.695106 -1.395241
C  1.134754 -3.067891 -0.067089
C  1.266402 -1.80359 -2.100728
C  0.969013 -2.987751 -1.442342
C  0.309859 -4.33466 1.768542
C  -0.661949 -3.442049 2.205932
C  0.716473 -5.388707 2.575162
C  -1.214757 -3.610079 3.467706
C  0.144564 -5.551023 3.828598
C  -0.817577 -4.660165 4.284239
H  0.073471 2.756637 -1.191685
H  -1.796713 2.185124 1.207923
H  1.083429 4.577773 1.772464
H  0.821746 5.482454 0.285688
H  1.597826 3.911908 0.221102
H  -1.703889 5.700852 0.433953
H  -1.437441 5.124471 2.077505
H  -2.637756 4.343253 1.064367
H  -2.94941 3.419339 -0.904553
H  2.383385 0.182034 1.835898
H  1.735933 -2.027823 1.724105
H  1.91819 0.229572 -1.917741
H  1.139067 -1.74437 -3.173544
H  0.610459 -3.848576 -1.992646
H  -0.992308 -2.621955 1.580573
H  1.471317 -6.079202 2.219294
H  -1.968332 -2.911763 3.808954
H  0.462366 -6.375845 4.453541
H  -1.257676 -4.785134 5.26487
elementType: Cl O N C H
totalener: -2050.68353342 hartree
nucrepener: 2798.57090935 hartree
electener: -4849.25444277 hartree
oneelecener: -8372.42622690 hartree
twoeener: 3523.17178414 hartree
cpcmener: -0.03100698 hartree
kineticenergy: 2044.46489045 hartree
xcener: -151.863088434944 hartree
chargesum: 0.0000000
charge: -0.057725 -0.058755 -0.273941 -0.440373 -0.326117 -0.085413 0.096552 0.012086 -0.064595 -0.258635 -0.286610 -0.196050 0.397917 0.047293 0.378264 0.028325 -0.230737 -0.200663 -0.231683 0.293656 -0.124088 -0.226662 0.300399 -0.199605 -0.257579 -0.138908 -0.115519 -0.191089 0.088556 0.099388 0.101222 0.096198 0.092457 0.104981 0.099952 0.093517 0.126809 0.137897 0.146127 0.147350 0.157047 0.148210 0.151928 0.145120 0.158452 0.157464 0.157581
qa: -0.0577 -0.0588 -0.2739 -0.4404 -0.3261 -0.0854 0.0966 0.0121 -0.0646 -0.2586 -0.2866 -0.1961 0.3979 0.0473 0.3783 0.0283 -0.2307 -0.2007 -0.2317 0.2937 -0.1241 -0.2267 0.3004 -0.1996 -0.2576 -0.1389 -0.1155 -0.1911 0.0886 0.0994 0.1012 0.0962 0.0925 0.1050 0.1000 0.0935 0.1268 0.1379 0.1461 0.1474 0.1570 0.1482 0.1519 0.1451 0.1585 0.1575 0.1576
va: 1.2714 1.2467 2.1298 2.0686 2.0885 3.1069 3.7662 3.8586 3.8227 3.9031 3.9220 3.8876 4.1853 4.2162 3.7823 3.5816 4.0626 3.9349 3.9633 3.7224 3.9156 4.0188 3.6850 3.9045 4.0124 3.8903 3.8804 3.9118 1.0328 1.0264 1.0006 1.0000 1.0109 0.9990 1.0008 1.0049 1.0225 1.0173 1.0078 1.0101 0.9913 1.0052 1.0050 1.0086 0.9908 0.9890 0.9906
dispcorr: -0.025349307 hartree
energy: -2050.708882725836
dipole: 4.94688 -6.32920 -1.38232 0.72897 0.04004 0.76901 27.14035 -26.25776 0.88260
magnitude: 1.81140 au
magnitude: 4.60421 debye
