program: Orca
programVersion: 5.0.2
elementType: Cl Cl O O O N C C C C C C C C C C C C C C C C C C C C C C H H H H H H H H H H H H H H H H H H H
charge: 0
multiplicity: 1
keywords: wb97x-d3
keywords: def2-TZVPP
keywords: def2/J RIJCOSX
keywords: DEFGRID2
keywords: scfconv7
keywords: smallprint printgap noloewdin
keywords: NOSOSCF
formula: C22H19Cl2NO3
InChI: InChI=1/C22H19Cl2NO3/c1-22(2)17(12-19(23)24)20(22)21(26)28-18(13-25)14-7-6-10-16(11-14)27-15-8-4-3-5-9-15/h3-12,17-18,20H,1-2H3
47 atoms
Cl -1.009494 2.40299 -3.698485
Cl -3.754296 3.265432 -3.489691
O  1.136671 1.418343 0.568516
O  -0.38999 0.587573 1.966985
O  0.810124 -4.488983 0.490372
N  4.347059 0.978561 -0.011897
C  -0.500801 3.988933 0.553389
C  -0.840794 3.147483 -0.640555
C  -0.924333 2.548748 0.759163
C  0.934681 4.423681 0.731903
C  -1.483393 5.025139 1.046954
C  -2.086464 3.315425 -1.396658
C  -0.058358 1.431443 1.173763
C  -2.251011 3.030079 -2.682263
C  1.961352 0.283976 0.7942
C  1.476802 -0.918437 0.017442
C  3.293199 0.689914 0.341004
C  1.367054 -2.141703 0.661348
C  1.143382 -0.784969 -1.325088
C  0.906543 -3.243654 -0.050175
C  0.689155 -1.893974 -2.020533
C  0.562492 -3.121531 -1.389813
C  0.565821 -4.668445 1.826068
C  -0.428268 -3.966395 2.496457
C  1.308626 -5.642592 2.476398
C  -0.666936 -4.24647 3.834057
C  1.049395 -5.920966 3.810752
C  0.065764 -5.222495 4.496214
H  0.014812 2.826941 -1.222338
H  -1.925112 2.430403 1.158938
H  1.205735 4.447355 1.789049
H  1.054363 5.436048 0.341487
H  1.651626 3.79343 0.21169
H  -1.417879 5.931972 0.442909
H  -1.253094 5.297247 2.078457
H  -2.517803 4.683309 1.028179
H  -2.953798 3.694208 -0.869626
H  2.034038 0.047968 1.860662
H  1.640933 -2.225494 1.70599
H  1.232743 0.169094 -1.828974
H  0.421878 -1.802064 -3.064909
H  0.201062 -3.985413 -1.933247
H  -1.015678 -3.211755 1.98817
H  2.07689 -6.183562 1.938334
H  -1.439941 -3.699555 4.358054
H  1.625785 -6.685786 4.314874
H  -0.131075 -5.438532 5.538009
elementType: Cl O N C H
totalener: -2050.68389070 hartree
nucrepener: 2760.69778662 hartree
electener: -4811.38167732 hartree
oneelecener: -8296.58878129 hartree
twoeener: 3485.20710397 hartree
cpcmener: -0.03156886 hartree
kineticenergy: 2044.47421136 hartree
xcener: -151.864671429598 hartree
chargesum: 0.0000000
charge: -0.057324 -0.058940 -0.274249 -0.436904 -0.324465 -0.085059 0.092861 0.025237 -0.062522 -0.260166 -0.278898 -0.205805 0.387093 0.046722 0.371445 0.008910 -0.229888 -0.187589 -0.206438 0.286495 -0.132987 -0.223635 0.291645 -0.202590 -0.250479 -0.136668 -0.118574 -0.185009 0.087734 0.097309 0.101851 0.096265 0.092225 0.102791 0.099706 0.092773 0.127352 0.140320 0.143032 0.144786 0.155539 0.148300 0.156669 0.146185 0.159417 0.157912 0.157616
qa: -0.0573 -0.0589 -0.2742 -0.4369 -0.3245 -0.0851 0.0929 0.0252 -0.0625 -0.2602 -0.2789 -0.2058 0.3871 0.0467 0.3714 0.0089 -0.2299 -0.1876 -0.2064 0.2865 -0.1330 -0.2236 0.2916 -0.2026 -0.2505 -0.1367 -0.1186 -0.1850 0.0877 0.0973 0.1019 0.0963 0.0922 0.1028 0.0997 0.0928 0.1274 0.1403 0.1430 0.1448 0.1555 0.1483 0.1567 0.1462 0.1594 0.1579 0.1576
va: 1.2701 1.2461 2.1212 2.0739 2.0875 3.1073 3.7450 3.8595 3.8245 3.9080 3.9205 3.8931 4.1971 4.2172 3.7752 3.6395 4.0669 3.9419 3.9586 3.7333 3.9325 4.0020 3.6817 3.9255 4.0166 3.8856 3.8797 3.9075 1.0300 1.0277 1.0002 1.0001 1.0107 0.9997 1.0004 1.0059 1.0222 1.0190 1.0068 1.0095 0.9919 1.0055 0.9990 1.0080 0.9900 0.9891 0.9907
dispcorr: -0.024683442 hartree
energy: -2050.708574143240
dipole: 7.26223 -8.50021 -1.23798 -2.95592 3.65362 0.69770 28.31176 -27.24308 1.06868
magnitude: 1.77805 au
magnitude: 4.51945 debye
