program: Gaussian 09
title: 000007255
version: EM64L-G09RevD.01
frameworkgroup: C1[X(C7H8ClN)]
method: RPBEPBE
basis: SDD
operation: Freq
keyword: #p
keyword: freq=noraman
keyword: PBEPBE/SDD
title: #p freq=noraman PBEPBE/SDD
converged: NO NO NO NO
title: Mulliken charges:
elementType: Cl N C C C C C C C H H H H H H H H
charge: -0.080787 -0.701807 0.517874 -0.235570 -0.378273 0.522175 -0.422578 -0.428682 -0.797517 0.227491 0.245143 0.218268 0.240831 0.240830 0.217661 0.306958 0.307983
chargesum: 0.00000
title: Mulliken charges with hydrogens summed into heavy atoms:
elementType: Cl N C C C C C C C
charge: -0.080787 -0.086866 0.517874 -0.235570 -0.150782 0.522175 -0.177436 -0.210414 -0.098195
polarizability: 1.30191154e+02 2.49192723e+00 1.01069046e+02 1.11893343e-02 1.60095209e-03 4.19176392e+01
1716.lowfreq: -1.5636 0.0016 0.0025 0.0034 7.5483 11.2399 120.8289 134.4708 176.7672
frequency: 120.7883 134.4629 176.7667 216.1931 282.2398 313.2061 348.7589 359.5371 389.5816 442.3748 455.2198 464.9752 581.7340 678.2841 697.3520 747.4648 807.6648 848.1723 878.2434 936.0794 989.1850 1014.7761 1037.7171 1045.6404 1154.2462 1218.0860 1271.1170 1319.1239 1367.4946 1402.3199 1425.0048 1461.5981 1476.9652 1509.3791 1565.9468 1633.7869 1645.3519 2978.0342 3055.1165 3086.7313 3118.3567 3141.8271 3149.6291 3570.1426 3709.9549
redmass: 1.4226 1.7555 5.0103 5.9401 3.2838 3.0085 1.2345 1.1228 5.8223 2.7684 3.1900 5.6044 3.9877 7.2981 2.5833 4.4409 1.3677 1.6867 5.6498 1.3388 1.4955 2.7681 1.3999 1.4789 1.2311 1.8628 1.6837 2.8791 4.4964 1.2265 3.5954 1.0450 1.1208 3.7968 6.0055 2.2538 1.7869 1.0366 1.0975 1.0994 1.0870 1.0962 1.0928 1.0450 1.1041
irintensity: 2.1228 1.3004 4.7579 0.2560 6.0233 7.2288 213.3213 108.2789 1.2315 4.9520 3.5787 1.2508 4.9655 9.2376 3.8720 7.4809 31.9231 46.9595 37.1951 0.1246 20.6696 39.6254 1.8338 7.1023 5.2187 5.3046 4.6014 33.4689 22.4555 8.4625 1.0123 13.1640 13.0778 131.8319 42.7604 10.3282 314.1402 36.5186 19.4948 19.2057 14.6174 25.1500 5.9595 70.8011 21.6154
temp: 298.150 k
press: 1.00000 atm
elementType: 17 7 6 6 6 6 6 6 6 1 1 1 1 1 1 1 1
symmnumber: 1
zpe: 348272.6 jmol-1
zpe.correction: 0.132650 hartree
zpe.thermalcorrener: 0.141634 hartree
zpe.thermalcorrenthalpy: 0.142578 hartree
zpe.thermalcorrgfe: 0.098913 hartree
zpe.sumelectzpe: -785.705695 hartree
zpe.sumelectthermal: -785.696711 hartree
zpe.sumelectthermalent: -785.695767 hartree
zpe.sumelectthermalfe: -785.739432 hartree
dipole: -3.3472 0.4128 -0.0010
dipole: 3.3725
quadrupole: -48.3193 -53.7638 -64.9799
quadrupole: 5.7570 0.0047 0.0018
quadrupole: 7.3684 1.9239 -9.2923 5.7570 0.0047 0.0018
hfenergy: -785.8383453 hartree
pointgroup: C01 [X(C7H8Cl1N1)]
dipole: 1.2633603 -0.4055247 -0.0003999 debye
dipolederiv: -0.4749081 0.3105363 0.0000581 0.3597447 -0.4972361 -0.0000511 0.0000506 -0.0000497 -0.0913275 -1.4971822 -0.3454773 -0.0000239 -0.3893078 -0.2095131 0.0000112 -0.0002573 -0.0000466 -0.7617337 -0.0432757 0.2392959 -0.0000047 0.1800775 -0.4453467 -0.0000235 -0.0001 -0.0000742 -0.0418657 0.7143161 -0.2771817 -0.0001277 -0.51143 0.8603155 0.0000755 -0.0001143 0.0000598 -0.0601969 0.2672214 -0.2420315 -0.0000494 0.0593923 0.134258 -0.0000137 -0.0000407 0.0000234 -0.1454211 1.5693132 0.4070641 -0.0000821 0.4074308 0.1402788 -0.0000225 -0.000082 -0.0000227 0.1498049 -0.5923949 -0.1435747 0.0000426 0.3267371 -0.1082494 -0.000046 0.000055 0.0000224 -0.1993598 -0.3157991 0.015577 0.0000035 -0.4783668 -0.0519272 0.000057 0.00002 -0.0000055 -0.2412068 -0.0853933 -0.0139391 0.0000031 0.0285715 0.1246363 0.0000095 0.0001069 0.0000836 0.0794898 0.0606583 -0.0586212 0.0000047 -0.0425269 -0.1145111 0.0000042 0.0000032 -0.0000057 0.1482868 0.0544789 -0.0551143 0.0000124 -0.0565912 -0.053738 0.000011 0.0000134 0.0000009 0.1785121 -0.0715479 0.1124973 0.000029 0.0971379 -0.0071817 -0.0000164 0.0000232 -0.0000163 0.1751682 -0.0355265 -0.0162062 0.0697795 0.0229711 0.0721115 -0.0842811 0.1195084 -0.0389548 -0.041607 -0.0355063 -0.0160818 -0.0697524 0.0231838 0.0719877 0.0844217 -0.1194437 0.0390664 -0.0413242 0.0785508 0.0378324 0.0000244 -0.0762552 -0.1616067 -0.0001424 -0.0000395 -0.0001423 0.1079378 0.2129416 0.0158319 0.0000479 -0.0058306 0.1140591 -0.0000196 0.0001615 -0.000016 0.3922538 0.1940536 0.0295928 0.0000351 0.0550619 0.1316631 0.0000264 0.0001352 0.0000775 0.3925893 unknown
polarizability: 130.0895767|-3.0261426|101.1706241|-0.0112914|0.0005174|41.9176392 unknown
InChI: InChI=1S/C7H8ClN/c1-5-2-3-6(9)4-7(5)8/h2-4H,9H2,1H3
charge 0 multiplicity 1
17 atoms
Cl -2.002294 2.015731 0.000377
N  2.999116 0.535713 -0.000166
C  -1.12746 -0.65156 0.00025
C  -0.718912 0.704174 0.00019
C  -0.069521 -1.599289 0.000114
C  1.658367 0.146997 -0.000077
C  0.620985 1.123499 0.000028
C  1.289208 -1.229312 -0.000044
C  -2.582639 -1.075118 0.000403
H  -0.331184 -2.664526 0.000127
H  0.861129 2.191844 0.000002
H  2.06716 -2.002051 -0.000138
H  -3.11826 -0.687724 0.887234
H  -3.118746 -0.686657 -0.88566
H  -2.666312 -2.175421 -0.000224
H  3.740445 -0.158073 -0.000434
H  3.259517 1.517072 -0.000382
