program: Orca
programVersion: 5.0.2
elementType: Cl Cl O O O N C C C C C C C C C C C C C C C C C C C C C C H H H H H H H H H H H H H H H H H H H
charge: 0
multiplicity: 1
keywords: wb97x-d3
keywords: def2-TZVPP
keywords: def2/J RIJCOSX
keywords: DEFGRID2
keywords: scfconv7
keywords: smallprint printgap noloewdin
keywords: NOSOSCF
formula: C22H19Cl2NO3
InChI: InChI=1/C22H19Cl2NO3/c1-22(2)17(12-19(23)24)20(22)21(26)28-18(13-25)14-7-6-10-16(11-14)27-15-8-4-3-5-9-15/h3-12,17-18,20H,1-2H3
47 atoms
Cl -3.062359 4.783552 1.338434
Cl -3.12732 6.304566 -1.111257
O  1.906667 1.120547 -0.679504
O  0.639724 1.226693 1.164796
O  1.266446 -3.828104 1.632645
N  5.202419 1.321511 -0.878886
C  -1.588574 1.350787 -1.066569
C  -1.451473 2.665002 -0.350765
C  -0.222281 1.999135 -0.928979
C  -1.943974 0.135356 -0.245682
C  -2.164927 1.309972 -2.460554
C  -1.922519 3.919666 -0.950696
C  0.781306 1.429225 -0.013226
C  -2.609704 4.863926 -0.32049
C  2.927374 0.423525 0.036377
C  2.774425 -1.064657 -0.158265
C  4.196908 0.926654 -0.489722
C  2.107495 -1.797672 0.81555
C  3.212149 -1.684238 -1.322594
C  1.887949 -3.153594 0.623208
C  3.00025 -3.043839 -1.493021
C  2.342584 -3.787947 -0.526213
C  0.31152 -4.767874 1.354397
C  -0.587537 -4.633979 0.302635
C  0.234808 -5.852422 2.21763
C  -1.559969 -5.606738 0.116378
C  -0.750423 -6.809934 2.025346
C  -1.647848 -6.696403 0.97197
H  -1.537363 2.599625 0.727952
H  0.181836 2.41558 -1.844952
H  -1.484131 -0.763114 -0.662504
H  -3.025259 -0.011275 -0.262093
H  -1.645636 0.214373 0.797281
H  -1.875189 0.383235 -2.958919
H  -1.830319 2.134288 -3.089104
H  -3.255621 1.339089 -2.423139
H  -1.697173 4.09798 -1.995411
H  2.900529 0.672815 1.100909
H  1.75973 -1.323397 1.724966
H  3.725764 -1.122004 -2.092817
H  3.357138 -3.534922 -2.388522
H  2.193965 -4.850893 -0.669247
H  -0.543013 -3.782911 -0.365468
H  0.937724 -5.94008 3.036846
H  -2.257257 -5.503519 -0.705091
H  -0.810093 -7.652424 2.702248
H  -2.410245 -7.448935 0.819902
elementType: Cl O N C H
totalener: -2050.68635977 hartree
nucrepener: 2695.62002764 hartree
electener: -4746.30638741 hartree
oneelecener: -8166.22764871 hartree
twoeener: 3419.92126129 hartree
cpcmener: -0.02988779 hartree
kineticenergy: 2044.46016888 hartree
xcener: -151.861122923744 hartree
chargesum: -0.0000000
charge: -0.054877 -0.060028 -0.273471 -0.441571 -0.325613 -0.088118 0.092226 0.035849 -0.091406 -0.273182 -0.264381 -0.207427 0.399375 0.041273 0.396498 0.009558 -0.220980 -0.221639 -0.194729 0.255134 -0.137307 -0.172748 0.286651 -0.188478 -0.248506 -0.154020 -0.122609 -0.182361 0.080683 0.099278 0.099332 0.100905 0.097031 0.099064 0.091466 0.102131 0.130372 0.134016 0.134274 0.141517 0.161631 0.158109 0.157522 0.145631 0.158450 0.157966 0.157509
qa: -0.0549 -0.0600 -0.2735 -0.4416 -0.3256 -0.0881 0.0922 0.0358 -0.0914 -0.2732 -0.2644 -0.2074 0.3994 0.0413 0.3965 0.0096 -0.2210 -0.2216 -0.1947 0.2551 -0.1373 -0.1727 0.2867 -0.1885 -0.2485 -0.1540 -0.1226 -0.1824 0.0807 0.0993 0.0993 0.1009 0.0970 0.0991 0.0915 0.1021 0.1304 0.1340 0.1343 0.1415 0.1616 0.1581 0.1575 0.1456 0.1584 0.1580 0.1575
va: 1.2705 1.2449 2.1279 2.0693 2.0768 3.1097 3.7343 3.8594 3.8584 3.9090 3.9047 3.8935 4.2029 4.2120 3.7285 3.6812 4.0684 4.0239 3.9939 3.7684 3.9160 3.9356 3.6891 3.8919 4.0027 3.9039 3.8915 3.9047 1.0482 1.0320 0.9988 1.0014 1.0168 1.0011 1.0055 1.0009 1.0176 1.0230 1.0296 1.0094 0.9906 0.9949 0.9954 1.0084 0.9909 0.9890 0.9905
dispcorr: -0.023565660 hartree
energy: -2050.709925432113
dipole: 1.71047 -3.11720 -1.40673 -41.26644 39.27189 -1.99456 -8.24730 6.96140 -1.28590
magnitude: 2.75875 au
magnitude: 7.01218 debye
