program: Orca
programVersion: 5.0.2
elementType: Cl Cl O O O N C C C C C C C C C C C C C C C C C C C C C C H H H H H H H H H H H H H H H H H H H
charge: 0
multiplicity: 1
keywords: wb97x-d3
keywords: def2-TZVPP
keywords: def2/J RIJCOSX
keywords: DEFGRID2
keywords: scfconv7
keywords: smallprint printgap noloewdin
keywords: NOSOSCF
formula: C22H19Cl2NO3
InChI: InChI=1/C22H19Cl2NO3/c1-22(2)17(12-19(23)24)20(22)21(26)28-18(13-25)14-7-6-10-16(11-14)27-15-8-4-3-5-9-15/h3-12,17-18,20H,1-2H3
47 atoms
Cl -1.777452 5.856567 -2.724868
Cl -4.465838 4.864655 -2.394801
O  0.85048 0.594462 0.027027
O  1.584961 2.439548 -0.992693
O  -0.020906 -4.184456 1.193011
N  2.189976 -0.598683 -2.836655
C  -0.708167 3.569127 0.969178
C  -1.034983 3.75631 -0.487233
C  -0.595894 2.39909 0.013211
C  0.5374 4.239154 1.493373
C  -1.812252 3.480354 1.993321
C  -2.415348 3.913637 -0.962834
C  0.717796 1.864799 -0.3878
C  -2.819354 4.765492 -1.896713
C  2.068148 -0.069763 -0.275535
C  2.11262 -1.348746 0.520979
C  2.130904 -0.350803 -1.716309
C  1.041888 -2.232537 0.4783
C  3.231535 -1.633071 1.29013
C  1.089227 -3.398098 1.228879
C  3.270203 -2.809537 2.024806
C  2.204842 -3.694655 2.006551
C  0.084298 -5.531742 1.43132
C  -0.70285 -6.077095 2.433111
C  0.906126 -6.334051 0.650363
C  -0.674506 -7.448536 2.648386
C  0.931872 -7.701222 0.882151
C  0.143569 -8.263044 1.878589
H  -0.281793 4.299624 -1.046726
H  -1.367159 1.644828 0.126831
H  0.972202 3.661125 2.311267
H  0.286314 5.226173 1.885524
H  1.304451 4.378426 0.733468
H  -2.686835 2.938512 1.635383
H  -2.136441 4.478183 2.294817
H  -1.45437 2.963962 2.885836
H  -3.176923 3.278401 -0.526377
H  2.931248 0.553003 -0.022878
H  0.167153 -2.02587 -0.127475
H  4.064165 -0.941929 1.32068
H  4.136205 -3.035877 2.632534
H  2.24671 -4.597635 2.601854
H  -1.337036 -5.43559 3.032148
H  1.512875 -5.900658 -0.135497
H  -1.292317 -7.877698 3.426613
H  1.568214 -8.330773 0.27366
H  0.164509 -9.331172 2.05038
elementType: Cl O N C H
totalener: -2050.68744233 hartree
nucrepener: 2619.08946409 hartree
electener: -4669.77690642 hartree
oneelecener: -8013.68501629 hartree
twoeener: 3343.90810987 hartree
cpcmener: -0.03354130 hartree
kineticenergy: 2044.47175420 hartree
xcener: -151.861913445028 hartree
chargesum: -0.0000000
charge: -0.054453 -0.060268 -0.277998 -0.435384 -0.324806 -0.087034 0.083663 0.025448 -0.071414 -0.259098 -0.263193 -0.202043 0.387428 0.039656 0.417500 0.000472 -0.233855 -0.226756 -0.179643 0.227828 -0.147867 -0.165029 0.237271 -0.216197 -0.167847 -0.136365 -0.150992 -0.165503 0.078903 0.100678 0.101014 0.099672 0.093615 0.090926 0.101097 0.099488 0.129857 0.128109 0.137171 0.147039 0.160276 0.156105 0.146562 0.160109 0.158393 0.158597 0.158867
qa: -0.0545 -0.0603 -0.2780 -0.4354 -0.3248 -0.0870 0.0837 0.0254 -0.0714 -0.2591 -0.2632 -0.2020 0.3874 0.0397 0.4175 0.0005 -0.2339 -0.2268 -0.1796 0.2278 -0.1479 -0.1650 0.2373 -0.2162 -0.1678 -0.1364 -0.1510 -0.1655 0.0789 0.1007 0.1010 0.0997 0.0936 0.0909 0.1011 0.0995 0.1299 0.1281 0.1372 0.1470 0.1603 0.1561 0.1466 0.1601 0.1584 0.1586 0.1589
va: 1.2712 1.2444 2.1614 2.0762 2.0738 3.1119 3.7628 3.8712 3.8365 3.9058 3.9043 3.8936 4.2079 4.2125 3.7266 3.7559 4.0201 4.0735 3.9427 3.8137 3.9285 3.8930 3.7202 3.9988 3.9240 3.8903 3.8935 3.8898 1.0495 1.0281 1.0000 1.0005 1.0158 1.0054 1.0014 1.0014 1.0183 1.0234 1.0279 1.0021 0.9916 0.9971 1.0062 0.9950 0.9895 0.9905 0.9899
dispcorr: -0.022141155 hartree
energy: -2050.709583488624
dipole: 14.78789 -14.69243 0.09545 -27.30319 26.08269 -1.22050 30.54467 -27.03192 3.51274
magnitude: 3.71996 au
magnitude: 9.45538 debye
