program: Orca
programVersion: 5.0.2
elementType: Cl Cl O O O N C C C C C C C C C C C C C C C C C C C C C C H H H H H H H H H H H H H H H H H H H
charge: 0
multiplicity: 1
keywords: wb97x-d3
keywords: def2-TZVPP
keywords: def2/J RIJCOSX
keywords: DEFGRID2
keywords: scfconv7
keywords: smallprint printgap noloewdin
keywords: NOSOSCF
formula: C22H19Cl2NO3
InChI: InChI=1/C22H19Cl2NO3/c1-22(2)17(12-19(23)24)20(22)21(26)28-18(13-25)14-7-6-10-16(11-14)27-15-8-4-3-5-9-15/h3-12,17-18,20H,1-2H3
47 atoms
Cl -0.395911 5.073692 -0.393038
Cl -3.085407 5.983596 -0.922388
O  1.453902 1.034902 -1.113599
O  1.044882 1.441237 1.043638
O  0.484731 -3.79494 -0.329315
N  4.056013 0.251999 -2.983405
C  -1.899183 0.975915 -0.126681
C  -1.68235 2.371311 0.35752
C  -0.67961 1.768613 -0.589436
C  -1.749279 -0.169241 0.843594
C  -2.938792 0.724101 -1.190701
C  -2.538663 3.491121 -0.094587
C  0.662942 1.423632 -0.097046
C  -2.070291 4.685744 -0.425599
C  2.714087 0.492539 -0.754544
C  2.590483 -0.863786 -0.094163
C  3.451549 0.370114 -2.014071
C  1.582568 -1.733419 -0.489371
C  3.487435 -1.230825 0.897177
C  1.474378 -2.972147 0.121902
C  3.37958 -2.484163 1.483664
C  2.378255 -3.36271 1.103319
C  -0.245996 -4.546951 0.549933
C  -0.639523 -5.805991 0.118734
C  -0.639013 -4.067645 1.794286
C  -1.43315 -6.592121 0.94103
C  -1.422531 -4.871215 2.610366
C  -1.823127 -6.1327 2.191435
H  -1.340207 2.458682 1.386138
H  -0.714491 2.088333 -1.625166
H  -2.707928 -0.366108 1.327377
H  -1.02338 0.020956 1.631953
H  -1.453897 -1.082425 0.323436
H  -2.695411 -0.176607 -1.75668
H  -3.020929 1.547014 -1.901555
H  -3.921158 0.572938 -0.738657
H  -3.611817 3.34024 -0.131321
H  3.275164 1.176856 -0.10922
H  0.874179 -1.462964 -1.26321
H  4.264298 -0.545649 1.212176
H  4.081648 -2.780371 2.251734
H  2.305287 -4.337178 1.569411
H  -0.330053 -6.163155 -0.855812
H  -0.347272 -3.080023 2.130667
H  -1.740638 -7.572863 0.601382
H  -1.725967 -4.499834 3.580802
H  -2.435963 -6.751406 2.833659
elementType: Cl O N C H
totalener: -2050.68393183 hartree
nucrepener: 2781.74450370 hartree
electener: -4832.42843552 hartree
oneelecener: -8338.81672725 hartree
twoeener: 3506.38829173 hartree
cpcmener: -0.03100310 hartree
kineticenergy: 2044.48060033 hartree
xcener: -151.865193299367 hartree
chargesum: -0.0000000
charge: -0.049552 -0.055564 -0.280114 -0.426291 -0.329628 -0.086830 0.154493 -0.026406 -0.146281 -0.282219 -0.283298 -0.221743 0.370971 0.074132 0.409322 0.032885 -0.229312 -0.252822 -0.199919 0.243192 -0.123738 -0.173345 0.304570 -0.254189 -0.194165 -0.120666 -0.157253 -0.181306 0.111733 0.116790 0.106995 0.099496 0.089654 0.101430 0.095518 0.102928 0.139773 0.144278 0.141119 0.144189 0.160144 0.158368 0.145201 0.155037 0.157204 0.158253 0.156968
qa: -0.0496 -0.0556 -0.2801 -0.4263 -0.3296 -0.0868 0.1545 -0.0264 -0.1463 -0.2822 -0.2833 -0.2217 0.3710 0.0741 0.4093 0.0329 -0.2293 -0.2528 -0.1999 0.2432 -0.1237 -0.1733 0.3046 -0.2542 -0.1942 -0.1207 -0.1573 -0.1813 0.1117 0.1168 0.1070 0.0995 0.0897 0.1014 0.0955 0.1029 0.1398 0.1443 0.1411 0.1442 0.1601 0.1584 0.1452 0.1550 0.1572 0.1583 0.1570
va: 1.2798 1.2501 2.1130 2.0813 2.0615 3.1129 3.7174 3.8867 3.8200 3.8867 3.9104 3.9053 4.1998 4.1898 3.7097 3.6102 4.0763 4.0092 3.9993 3.7851 3.8940 3.9218 3.6508 4.0163 3.8892 3.8879 3.9132 3.9039 1.0234 1.0227 1.0035 1.0137 1.0011 1.0037 0.9984 0.9994 1.0084 1.0155 1.0242 1.0028 0.9899 0.9940 1.0087 0.9971 0.9892 0.9909 0.9905
dispcorr: -0.026293291 hartree
energy: -2050.710225118519
dipole: -6.48978 4.85357 -1.63621 -40.90939 39.69198 -1.21741 11.51004 -9.85863 1.65140
magnitude: 2.62420 au
magnitude: 6.67018 debye
