program: Orca
programVersion: 5.0.2
elementType: Cl Cl O O O N C C C C C C C C C C C C C C C C C C C C C C H H H H H H H H H H H H H H H H H H H
charge: 0
multiplicity: 1
keywords: wb97x-d3
keywords: def2-TZVPP
keywords: def2/J RIJCOSX
keywords: DEFGRID2
keywords: scfconv7
keywords: smallprint printgap noloewdin
keywords: NOSOSCF
formula: C22H19Cl2NO3
InChI: InChI=1/C22H19Cl2NO3/c1-22(2)17(12-19(23)24)20(22)21(26)28-18(13-25)14-7-6-10-16(11-14)27-15-8-4-3-5-9-15/h3-12,17-18,20H,1-2H3
47 atoms
Cl 0.034571 5.130796 -1.246028
Cl -2.560794 6.394306 -1.364685
O  1.140044 0.857027 -1.299397
O  1.331704 1.692289 0.764255
O  -0.352265 -3.394079 0.74346
N  3.075242 -0.685414 -3.481463
C  -1.837058 1.570946 0.432182
C  -1.330627 2.973462 0.486234
C  -0.692817 2.009444 -0.478425
C  -1.581335 0.657106 1.604376
C  -3.140582 1.291227 -0.274001
C  -2.127344 4.105911 -0.035776
C  0.678837 1.539316 -0.234666
C  -1.620126 5.076398 -0.781864
C  2.359502 0.157214 -1.114824
C  2.205469 -1.017106 -0.171629
C  2.745512 -0.304566 -2.449618
C  1.021554 -1.742118 -0.163063
C  3.247507 -1.360123 0.676877
C  0.869339 -2.791986 0.731032
C  3.08883 -2.427231 1.548916
C  1.901326 -3.141068 1.595031
C  -0.485663 -4.712409 1.090586
C  -1.545877 -5.042713 1.92243
C  0.354355 -5.696388 0.583622
C  -1.768685 -6.373408 2.247481
C  0.128207 -7.020751 0.92915
C  -0.929948 -7.365961 1.759994
H  -0.725303 3.216061 1.356586
H  -0.959784 2.103541 -1.525163
H  -0.66681 0.892568 2.145195
H  -1.525139 -0.385544 1.284572
H  -2.40645 0.735395 2.314705
H  -3.982506 1.42703 0.407754
H  -3.16788 0.259883 -0.629642
H  -3.299726 1.940903 -1.134961
H  -3.178213 4.163435 0.225017
H  3.153629 0.82299 -0.759963
H  0.203659 -1.495573 -0.829658
H  4.169881 -0.793298 0.668523
H  3.892507 -2.695702 2.221738
H  1.787321 -3.949985 2.3050
H  -2.194541 -4.264008 2.30436
H  1.173187 -5.440537 -0.077559
H  -2.599366 -6.630589 2.892315
H  0.782805 -7.788324 0.536817
H  -1.10181 -8.401969 2.020998
elementType: Cl O N C H
totalener: -2050.68376158 hartree
nucrepener: 2752.55317484 hartree
electener: -4803.23693642 hartree
oneelecener: -8280.68975126 hartree
twoeener: 3477.45281484 hartree
cpcmener: -0.03070438 hartree
kineticenergy: 2044.47712116 hartree
xcener: -151.864480147528 hartree
chargesum: 0.0000000
charge: -0.049374 -0.055965 -0.280998 -0.426824 -0.327779 -0.086455 0.142395 -0.020102 -0.145106 -0.272342 -0.281237 -0.225939 0.369435 0.076903 0.409976 0.052400 -0.231709 -0.290455 -0.209343 0.300635 -0.120641 -0.201669 0.270677 -0.240997 -0.191032 -0.127525 -0.149059 -0.175752 0.111604 0.116577 0.098039 0.090441 0.105062 0.102606 0.100105 0.094999 0.140277 0.144795 0.138702 0.144415 0.160165 0.158342 0.148028 0.158379 0.158042 0.159541 0.157763
qa: -0.0494 -0.0560 -0.2810 -0.4268 -0.3278 -0.0865 0.1424 -0.0201 -0.1451 -0.2723 -0.2812 -0.2259 0.3694 0.0769 0.4100 0.0524 -0.2317 -0.2905 -0.2093 0.3006 -0.1206 -0.2017 0.2707 -0.2410 -0.1910 -0.1275 -0.1491 -0.1758 0.1116 0.1166 0.0980 0.0904 0.1051 0.1026 0.1001 0.0950 0.1403 0.1448 0.1387 0.1444 0.1602 0.1583 0.1480 0.1584 0.1580 0.1595 0.1578
va: 1.2799 1.2498 2.1102 2.0813 2.0595 3.1134 3.7138 3.8792 3.8202 3.8885 3.9116 3.9067 4.1982 4.1890 3.7113 3.5888 4.0801 4.0414 4.0077 3.7119 3.9022 3.9388 3.7082 4.0003 3.9175 3.8903 3.8948 3.8992 1.0233 1.0229 1.0150 1.0049 1.0030 0.9997 1.0038 0.9986 1.0085 1.0145 1.0266 1.0028 0.9902 0.9950 1.0056 0.9965 0.9897 0.9902 0.9904
dispcorr: -0.025437648 hartree
energy: -2050.709199227899
dipole: -6.37209 5.19357 -1.17852 -40.26402 39.19584 -1.06818 18.35841 -16.44007 1.91833
magnitude: 2.49197 au
magnitude: 6.33409 debye
