program: Orca
programVersion: 5.0.2
elementType: Cl Cl O O O N C C C C C C C C C C C C C C C C C C C C C C H H H H H H H H H H H H H H H H H H H
charge: 0
multiplicity: 1
keywords: wb97x-d3
keywords: def2-TZVPP
keywords: def2/J RIJCOSX
keywords: DEFGRID2
keywords: scfconv7
keywords: smallprint printgap noloewdin
keywords: NOSOSCF
formula: C22H19Cl2NO3
InChI: InChI=1/C22H19Cl2NO3/c1-22(2)17(12-19(23)24)20(22)21(26)28-18(13-25)14-7-6-10-16(11-14)27-15-8-4-3-5-9-15/h3-12,17-18,20H,1-2H3
47 atoms
Cl -2.057688 5.453498 -2.926545
Cl -4.66134 4.549446 -2.074958
O  0.950821 0.681171 0.135133
O  1.627458 2.464306 -1.023874
O  0.017028 -4.108158 1.243923
N  2.176782 -0.532765 -2.78885
C  -0.475579 3.835471 0.934915
C  -0.988968 3.780985 -0.475696
C  -0.453147 2.522197 0.174507
C  0.802616 4.596218 1.186221
C  -1.445341 3.910639 2.089133
C  -2.422409 3.850123 -0.786051
C  0.805218 1.936782 -0.318953
C  -2.961638 4.524787 -1.793898
C  2.138749 -0.007167 -0.2249
C  2.183176 -1.300341 0.549745
C  2.148923 -0.279099 -1.668798
C  1.091153 -2.159433 0.532142
C  3.326161 -1.627605 1.264674
C  1.143427 -3.343333 1.252332
C  3.367385 -2.820743 1.971905
C  2.281968 -3.680861 1.978581
C  0.10814 -5.467634 1.403438
C  -0.690352 -6.058701 2.370234
C  0.925033 -6.236845 0.584266
C  -0.674835 -7.439449 2.513783
C  0.938773 -7.614182 0.745696
C  0.141526 -8.220522 1.708161
H  -0.327913 4.226429 -1.210461
H  -1.186452 1.79467 0.50396
H  1.355659 4.158378 2.020018
H  0.56514 5.627591 1.453636
H  1.462726 4.629521 0.321822
H  -2.322803 3.279601 1.953413
H  -1.789342 4.936383 2.234215
H  -0.95621 3.591276 3.011097
H  -3.106129 3.302479 -0.147911
H  3.024556 0.593426 0.004207
H  0.197649 -1.920273 -0.033032
H  4.176524 -0.957707 1.273916
H  4.25234 -3.080435 2.53756
H  2.326667 -4.597745 2.55187
H  -1.322097 -5.444205 2.99947
H  1.53986 -5.770735 -0.176072
H  -1.300837 -7.902531 3.265608
H  1.573158 -8.216379 0.108011
H  0.154209 -9.296011 1.825624
elementType: Cl O N C H
totalener: -2050.68759443 hartree
nucrepener: 2621.06172739 hartree
electener: -4671.74932181 hartree
oneelecener: -8017.69949630 hartree
twoeener: 3345.95017449 hartree
cpcmener: -0.03365725 hartree
kineticenergy: 2044.46027905 hartree
xcener: -151.860616928713 hartree
chargesum: -0.0000000
charge: -0.054326 -0.059848 -0.280611 -0.439766 -0.325221 -0.087796 0.080031 0.032943 -0.071762 -0.264799 -0.263056 -0.203637 0.394214 0.041356 0.422112 -0.001460 -0.235829 -0.225219 -0.178816 0.224809 -0.147457 -0.164124 0.245672 -0.222504 -0.172212 -0.133227 -0.148949 -0.169271 0.081045 0.098772 0.100972 0.099180 0.095415 0.090936 0.102323 0.098783 0.129155 0.129594 0.137438 0.146779 0.160378 0.156775 0.146160 0.159643 0.158181 0.158648 0.158579
qa: -0.0543 -0.0598 -0.2806 -0.4398 -0.3252 -0.0878 0.0800 0.0329 -0.0718 -0.2648 -0.2631 -0.2036 0.3942 0.0414 0.4221 -0.0015 -0.2358 -0.2252 -0.1788 0.2248 -0.1475 -0.1641 0.2457 -0.2225 -0.1722 -0.1332 -0.1489 -0.1693 0.0810 0.0988 0.1010 0.0992 0.0954 0.0909 0.1023 0.0988 0.1292 0.1296 0.1374 0.1468 0.1604 0.1568 0.1462 0.1596 0.1582 0.1586 0.1586
va: 1.2713 1.2448 2.1641 2.0696 2.0745 3.1125 3.7538 3.8620 3.8528 3.9061 3.9071 3.8982 4.1856 4.2125 3.7271 3.7547 4.0179 4.0729 3.9446 3.8190 3.9265 3.8947 3.7143 4.0017 3.9190 3.8897 3.8922 3.8931 1.0486 1.0289 0.9994 1.0002 1.0165 1.0056 1.0009 1.0015 1.0185 1.0208 1.0279 1.0025 0.9916 0.9963 1.0067 0.9952 0.9894 0.9905 0.9901
dispcorr: -0.022071095 hartree
energy: -2050.709665521026
dipole: 17.68167 -17.36668 0.31500 -23.54201 22.56887 -0.97314 29.46404 -25.93420 3.52984
magnitude: 3.67505 au
magnitude: 9.34123 debye
