program: Orca
programVersion: 5.0.2
elementType: Cl Cl O O O N C C C C C C C C C C C C C C C C C C C C C C H H H H H H H H H H H H H H H H H H H
charge: 0
multiplicity: 1
keywords: wb97x-d3
keywords: def2-TZVPP
keywords: def2/J RIJCOSX
keywords: DEFGRID2
keywords: scfconv7
keywords: smallprint printgap noloewdin
keywords: NOSOSCF
formula: C22H19Cl2NO3
InChI: InChI=1/C22H19Cl2NO3/c1-22(2)17(12-19(23)24)20(22)21(26)28-18(13-25)14-7-6-10-16(11-14)27-15-8-4-3-5-9-15/h3-12,17-18,20H,1-2H3
47 atoms
Cl -3.689487 1.800749 2.102245
Cl -2.895014 3.891184 3.924963
O  2.082897 1.518579 -0.547725
O  0.128302 0.572082 -1.054505
O  1.030165 -4.092948 0.425008
N  2.326038 -0.277653 -3.444752
C  -0.828448 3.57818 -0.855238
C  -1.270385 2.798432 0.348275
C  0.185438 2.761253 -0.07676
C  -1.311458 3.114927 -2.20731
C  -0.67063 5.076512 -0.768568
C  -1.603737 3.443768 1.623778
C  0.742046 1.506735 -0.608961
C  -2.596561 3.088715 2.4297
C  2.777378 0.343053 -0.945519
C  2.595572 -0.800098 0.027666
C  2.47531 -0.009223 -2.337924
C  1.860437 -1.935138 -0.291794
C  3.189004 -0.67183 1.277087
C  1.734509 -2.951963 0.646722
C  3.041682 -1.688733 2.208883
C  2.322355 -2.830255 1.901169
C  0.513365 -4.346053 -0.823546
C  -0.853187 -4.218095 -1.012625
C  1.344829 -4.766451 -1.851688
C  -1.397007 -4.524153 -2.252976
C  0.790729 -5.059941 -3.089415
C  -0.578047 -4.940301 -3.293257
H  -1.829751 1.898585 0.118497
H  0.878552 3.34346 0.520033
H  -2.230048 3.645081 -2.465184
H  -1.529858 2.05028 -2.248407
H  -0.574366 3.340253 -2.980453
H  -0.017183 5.431818 -1.56808
H  -0.239074 5.410637 0.174583
H  -1.638186 5.568893 -0.888384
H  -0.986041 4.272075 1.950099
H  3.827474 0.644971 -0.937573
H  1.391285 -2.025651 -1.262708
H  3.767227 0.209953 1.523408
H  3.50158 -1.596789 3.184031
H  2.21539 -3.627964 2.625618
H  -1.484331 -3.889766 -0.196219
H  2.410987 -4.864817 -1.687566
H  -2.464687 -4.431341 -2.404518
H  1.433202 -5.387468 -3.896478
H  -1.004907 -5.175018 -4.259577
elementType: Cl O N C H
totalener: -2050.68502101 hartree
nucrepener: 2765.27732560 hartree
electener: -4815.96234661 hartree
oneelecener: -8307.22287351 hartree
twoeener: 3491.26052690 hartree
cpcmener: -0.03291064 hartree
kineticenergy: 2044.47618466 hartree
xcener: -151.866099489513 hartree
chargesum: 0.0000000
charge: -0.054175 -0.059789 -0.282823 -0.442952 -0.323578 -0.082155 0.086430 0.032859 -0.095689 -0.263924 -0.263653 -0.204729 0.429227 0.041211 0.464116 -0.065970 -0.248840 -0.138032 -0.261144 0.282143 -0.104677 -0.242384 0.234529 -0.188176 -0.176462 -0.148134 -0.151493 -0.153751 0.079573 0.094703 0.097984 0.095384 0.100429 0.099040 0.090297 0.101487 0.129666 0.146033 0.123289 0.143825 0.157568 0.145965 0.147925 0.153086 0.157719 0.158980 0.159060
qa: -0.0542 -0.0598 -0.2828 -0.4430 -0.3236 -0.0822 0.0864 0.0329 -0.0957 -0.2639 -0.2637 -0.2047 0.4292 0.0412 0.4641 -0.0660 -0.2488 -0.1380 -0.2611 0.2821 -0.1047 -0.2424 0.2345 -0.1882 -0.1765 -0.1481 -0.1515 -0.1538 0.0796 0.0947 0.0980 0.0954 0.1004 0.0990 0.0903 0.1015 0.1297 0.1460 0.1233 0.1438 0.1576 0.1460 0.1479 0.1531 0.1577 0.1590 0.1591
va: 1.2716 1.2448 2.1372 2.0672 2.0914 3.1067 3.7403 3.8678 3.8646 3.9080 3.9050 3.8987 4.1536 4.2148 3.8352 3.7257 4.0701 3.8603 4.0021 3.7999 3.9003 4.0111 3.7282 3.9876 3.9469 3.8948 3.8923 3.8838 1.0481 1.0340 1.0003 1.0187 0.9997 1.0013 1.0058 1.0010 1.0187 0.9921 1.0325 1.0059 0.9891 1.0077 1.0036 0.9987 0.9901 0.9902 0.9898
dispcorr: -0.023787789 hartree
energy: -2050.708808803297
dipole: 13.76528 -12.56349 1.20179 -3.67029 5.11278 1.44249 -22.36307 23.18815 0.82509
magnitude: 2.05081 au
magnitude: 5.21276 debye
