program: Orca
programVersion: 5.0.2
elementType: Cl Cl O O O N C C C C C C C C C C C C C C C C C C C C C C H H H H H H H H H H H H H H H H H H H
charge: 0
multiplicity: 1
keywords: wb97x-d3
keywords: def2-TZVPP
keywords: def2/J RIJCOSX
keywords: DEFGRID2
keywords: scfconv7
keywords: smallprint printgap noloewdin
keywords: NOSOSCF
formula: C22H19Cl2NO3
InChI: InChI=1/C22H19Cl2NO3/c1-22(2)17(12-19(23)24)20(22)21(26)28-18(13-25)14-7-6-10-16(11-14)27-15-8-4-3-5-9-15/h3-12,17-18,20H,1-2H3
47 atoms
Cl -2.64323 3.696365 1.14889
Cl -3.20716 6.348755 0.157157
O  0.633575 1.07623 0.580184
O  -0.99762 0.333833 -0.753646
O  1.210198 -4.682718 -0.864036
N  2.169736 0.046627 3.310032
C  -0.176222 2.951147 -2.359058
C  -1.476321 3.128066 -1.651813
C  -0.287315 2.620468 -0.874952
C  -0.047305 1.84981 -3.380776
C  0.656106 4.169355 -2.678031
C  -2.027005 4.466739 -1.34517
C  -0.290231 1.234864 -0.38416
C  -2.552701 4.792389 -0.173054
C  0.761433 -0.226606 1.126008
C  1.459086 -1.190562 0.193053
C  1.552302 -0.051704 2.346966
C  0.990825 -2.492108 0.107072
C  2.562875 -0.78244 -0.547811
C  1.647783 -3.39902 -0.715696
C  3.188767 -1.692159 -1.385171
C  2.743156 -3.003449 -1.468022
C  0.839703 -5.410913 0.234531
C  1.512641 -5.320824 1.447476
C  -0.214664 -6.299016 0.073451
C  1.110272 -6.123787 2.505269
C  -0.597394 -7.103608 1.136909
C  0.056817 -7.016108 2.358121
H  -2.228673 2.374644 -1.873998
H  0.205852 3.32821 -0.218357
H  0.970202 1.454908 -3.404461
H  -0.268599 2.24626 -4.373664
H  -0.727602 1.018605 -3.206148
H  1.706614 3.894709 -2.788469
H  0.596198 4.934033 -1.902712
H  0.332964 4.619797 -3.618556
H  -2.026835 5.217547 -2.127572
H  -0.213479 -0.628482 1.422634
H  0.118683 -2.793455 0.675586
H  2.934521 0.232128 -0.47933
H  4.045065 -1.383623 -1.970245
H  3.241023 -3.716203 -2.113267
H  2.34535 -4.640178 1.574003
H  -0.726217 -6.36183 -0.878976
H  1.633246 -6.052089 3.450323
H  -1.418223 -7.797411 1.00825
H  -0.2490 -7.640572 3.187142
elementType: Cl O N C H
totalener: -2050.68438592 hartree
nucrepener: 2722.19081229 hartree
electener: -4772.87519821 hartree
oneelecener: -8220.02213887 hartree
twoeener: 3447.14694066 hartree
cpcmener: -0.03100184 hartree
kineticenergy: 2044.48048777 hartree
xcener: -151.863920319143 hartree
chargesum: 0.0000000
charge: -0.049418 -0.055299 -0.278352 -0.435699 -0.328357 -0.086694 0.133007 -0.020744 -0.146985 -0.267955 -0.280944 -0.224545 0.385952 0.079230 0.405011 0.029635 -0.226806 -0.175687 -0.220115 0.236991 -0.130107 -0.209441 0.273526 -0.181033 -0.245972 -0.148255 -0.121415 -0.185755 0.111644 0.116612 0.097871 0.098810 0.094830 0.099912 0.095041 0.102751 0.139655 0.140724 0.146351 0.147269 0.159115 0.149308 0.155026 0.146296 0.159354 0.157484 0.158170
qa: -0.0494 -0.0553 -0.2784 -0.4357 -0.3284 -0.0867 0.1330 -0.0207 -0.1470 -0.2680 -0.2809 -0.2245 0.3860 0.0792 0.4050 0.0296 -0.2268 -0.1757 -0.2201 0.2370 -0.1301 -0.2094 0.2735 -0.1810 -0.2460 -0.1483 -0.1214 -0.1858 0.1116 0.1166 0.0979 0.0988 0.0948 0.0999 0.0950 0.1028 0.1397 0.1407 0.1464 0.1473 0.1591 0.1493 0.1550 0.1463 0.1594 0.1575 0.1582
va: 1.2808 1.2507 2.1187 2.0773 2.0767 3.1132 3.7209 3.8695 3.8303 3.8934 3.9141 3.9108 4.1658 4.1844 3.7271 3.5887 4.0766 3.9775 3.9529 3.7640 3.9129 4.0047 3.7038 3.8950 4.0022 3.8987 3.8858 3.9049 1.0236 1.0229 1.0007 1.0020 1.0164 1.0031 0.9989 0.9995 1.0088 1.0193 1.0050 1.0126 0.9892 1.0037 0.9981 1.0080 0.9904 0.9891 0.9904
dispcorr: -0.024426016 hartree
energy: -2050.708811937823
dipole: 18.09883 -17.94261 0.15622 -24.26623 24.53401 0.26778 -18.04246 16.13343 -1.90903
magnitude: 1.93404 au
magnitude: 4.91593 debye
