program: Orca
programVersion: 5.0.2
elementType: Cl Cl O O O N C C C C C C C C C C C C C C C C C C C C C C H H H H H H H H H H H H H H H H H H H
charge: 0
multiplicity: 1
keywords: wb97x-d3
keywords: def2-TZVPP
keywords: def2/J RIJCOSX
keywords: DEFGRID2
keywords: scfconv7
keywords: smallprint printgap noloewdin
keywords: NOSOSCF
formula: C22H19Cl2NO3
InChI: InChI=1/C22H19Cl2NO3/c1-22(2)17(12-19(23)24)20(22)21(26)28-18(13-25)14-7-6-10-16(11-14)27-15-8-4-3-5-9-15/h3-12,17-18,20H,1-2H3
47 atoms
Cl -2.489058 3.766339 1.285014
Cl -3.051416 6.405272 0.257116
O  0.730198 1.100691 0.552035
O  -1.010825 0.303774 -0.599462
O  1.331989 -4.67913 -0.812831
N  2.485825 0.185792 3.184988
C  -0.338889 2.835715 -2.395384
C  -1.555511 3.07986 -1.570393
C  -0.304082 2.577698 -0.892404
C  -0.34951 1.687539 -3.37278
C  0.491322 4.009894 -2.85303
C  -2.042613 4.444444 -1.270147
C  -0.273946 1.218138 -0.335227
C  -2.468615 4.820794 -0.072999
C  0.925001 -0.182315 1.12183
C  1.5684 -1.155572 0.15922
C  1.801794 0.040422 2.273943
C  1.122687 -2.46862 0.140335
C  2.597715 -0.739256 -0.676246
C  1.73395 -3.382276 -0.710015
C  3.175523 -1.656199 -1.540737
C  2.756575 -2.977203 -1.55719
C  0.853549 -5.365017 0.271017
C  1.427379 -5.263819 1.532839
C  -0.2033 -6.234557 0.040934
C  0.919461 -6.034415 2.569369
C  -0.690078 -7.009583 1.083395
C  -0.137122 -6.908767 2.352515
H  -2.342159 2.336181 -1.677414
H  0.265662 3.305757 -0.326305
H  0.653482 1.278376 -3.507676
H  -0.694351 2.041269 -4.346079
H  -1.007177 0.874549 -3.073275
H  1.520055 3.696242 -3.038809
H  0.521842 4.815837 -2.118895
H  0.098926 4.421489 -3.785011
H  -2.078942 5.170946 -2.074356
H  -0.015059 -0.594065 1.504234
H  0.303919 -2.767703 0.78361
H  2.949318 0.284484 -0.66096
H  3.972488 -1.343901 -2.202621
H  3.217355 -3.693212 -2.226075
H  2.261931 -4.598145 1.714663
H  -0.633913 -6.308003 -0.950006
H  1.362931 -5.952581 3.553456
H  -1.510235 -7.691375 0.898821
H  -0.522869 -7.509819 3.165423
elementType: Cl O N C H
totalener: -2050.68435992 hartree
nucrepener: 2723.32983214 hartree
electener: -4774.01419206 hartree
oneelecener: -8222.28389000 hartree
twoeener: 3448.26969794 hartree
cpcmener: -0.03078071 hartree
kineticenergy: 2044.47899480 hartree
xcener: -151.864288162182 hartree
chargesum: -0.0000000
charge: -0.049358 -0.054907 -0.278115 -0.436003 -0.324207 -0.087266 0.134196 -0.024794 -0.143402 -0.268565 -0.279138 -0.220659 0.383415 0.076712 0.405962 0.024414 -0.227238 -0.200790 -0.227097 0.281205 -0.122912 -0.227579 0.297508 -0.207112 -0.254320 -0.137866 -0.116796 -0.189179 0.112632 0.115331 0.097601 0.099000 0.094660 0.100131 0.094049 0.102078 0.140456 0.139492 0.144697 0.147232 0.158282 0.148322 0.157519 0.146065 0.159629 0.158103 0.158613
qa: -0.0494 -0.0549 -0.2781 -0.4360 -0.3242 -0.0873 0.1342 -0.0248 -0.1434 -0.2686 -0.2791 -0.2207 0.3834 0.0767 0.4060 0.0244 -0.2272 -0.2008 -0.2271 0.2812 -0.1229 -0.2276 0.2975 -0.2071 -0.2543 -0.1379 -0.1168 -0.1892 0.1126 0.1153 0.0976 0.0990 0.0947 0.1001 0.0940 0.1021 0.1405 0.1395 0.1447 0.1472 0.1583 0.1483 0.1575 0.1461 0.1596 0.1581 0.1586
va: 1.2809 1.2512 2.1167 2.0769 2.0879 3.1133 3.7238 3.8761 3.8299 3.8931 3.9137 3.9080 4.1696 4.1844 3.7274 3.6098 4.0751 3.9811 3.9586 3.7363 3.9109 4.0045 3.6823 3.9211 4.0139 3.8871 3.8800 3.9107 1.0227 1.0237 1.0008 1.0018 1.0173 1.0030 0.9992 0.9997 1.0081 1.0201 1.0060 1.0126 0.9894 1.0052 0.9970 1.0085 0.9900 0.9890 0.9904
dispcorr: -0.024345865 hartree
energy: -2050.708705787632
dipole: 15.42612 -15.52601 -0.09990 -25.25982 25.37757 0.11775 -19.24319 17.28615 -1.95704
magnitude: 1.96312 au
magnitude: 4.98986 debye
