program: Orca
programVersion: 5.0.2
elementType: Cl Cl O O O N C C C C C C C C C C C C C C C C C C C C C C H H H H H H H H H H H H H H H H H H H
charge: 0
multiplicity: 1
keywords: wb97x-d3
keywords: def2-TZVPP
keywords: def2/J RIJCOSX
keywords: DEFGRID2
keywords: scfconv7
keywords: smallprint printgap noloewdin
keywords: NOSOSCF
formula: C22H19Cl2NO3
InChI: InChI=1/C22H19Cl2NO3/c1-22(2)17(12-19(23)24)20(22)21(26)28-18(13-25)14-7-6-10-16(11-14)27-15-8-4-3-5-9-15/h3-12,17-18,20H,1-2H3
47 atoms
Cl -3.640576 3.567329 1.343272
Cl -3.365518 5.793349 -0.473007
O  1.868641 1.141029 -0.215206
O  0.132567 0.151334 0.789298
O  1.93779 -4.445667 0.452543
N  4.963505 1.779328 0.745644
C  -1.42863 1.118145 -1.730401
C  -1.658436 2.093813 -0.615144
C  -0.238698 1.704833 -0.994431
C  -1.849542 -0.31498 -1.507555
C  -1.593419 1.560916 -3.16466
C  -2.088034 3.474868 -0.862156
C  0.556046 0.913098 -0.041507
C  -2.914972 4.174018 -0.095126
C  2.768138 0.374321 0.58539
C  3.001454 -0.982215 -0.031617
C  3.994991 1.169045 0.658557
C  2.396737 -2.089768 0.543206
C  3.74146 -1.109843 -1.202519
C  2.510647 -3.32674 -0.077677
C  3.873574 -2.356661 -1.791346
C  3.25012 -3.467759 -1.241647
C  0.656161 -4.386895 0.93216
C  0.370211 -5.145503 2.058163
C  -0.339347 -3.649881 0.300959
C  -0.925364 -5.169523 2.553721
C  -1.628411 -3.678043 0.813228
C  -1.929052 -4.434999 1.937852
H  -2.014786 1.647268 0.306118
H  0.327734 2.441439 -1.552538
H  -1.175065 -1.003915 -2.0199
H  -2.847567 -0.46443 -1.923702
H  -1.891771 -0.594144 -0.457802
H  -1.183904 2.551078 -3.360652
H  -2.649079 1.573532 -3.442429
H  -1.08484 0.862859 -3.831864
H  -1.697561 3.97777 -1.738582
H  2.392665 0.271025 1.607914
H  1.83424 -1.985952 1.462466
H  4.215831 -0.247632 -1.655298
H  4.453397 -2.465195 -2.698177
H  3.337007 -4.438798 -1.712497
H  1.156285 -5.714431 2.538682
H  -0.123614 -3.063097 -0.583454
H  -1.146062 -5.762561 3.431857
H  -2.403905 -3.10586 0.319908
H  -2.937334 -4.453333 2.329791
elementType: Cl O N C H
totalener: -2050.68604921 hartree
nucrepener: 2766.87058295 hartree
electener: -4817.55663217 hartree
oneelecener: -8308.89268143 hartree
twoeener: 3491.33604926 hartree
cpcmener: -0.03067280 hartree
kineticenergy: 2044.47709381 hartree
xcener: -151.864450044797 hartree
chargesum: -0.0000000
charge: -0.054927 -0.059357 -0.276169 -0.447876 -0.329732 -0.087252 0.108138 0.032264 -0.089278 -0.286494 -0.269998 -0.204080 0.409902 0.042092 0.400744 -0.004143 -0.222987 -0.157469 -0.206019 0.247497 -0.129621 -0.215164 0.277940 -0.242098 -0.191215 -0.125231 -0.147743 -0.184063 0.082654 0.097561 0.105078 0.101804 0.087577 0.093287 0.102062 0.099041 0.128571 0.135656 0.144362 0.143435 0.159790 0.148767 0.145123 0.161803 0.157192 0.161185 0.157390
qa: -0.0549 -0.0594 -0.2762 -0.4479 -0.3297 -0.0873 0.1081 0.0323 -0.0893 -0.2865 -0.2700 -0.2041 0.4099 0.0421 0.4007 -0.0041 -0.2230 -0.1575 -0.2060 0.2475 -0.1296 -0.2152 0.2779 -0.2421 -0.1912 -0.1252 -0.1477 -0.1841 0.0827 0.0976 0.1051 0.1018 0.0876 0.0933 0.1021 0.0990 0.1286 0.1357 0.1444 0.1434 0.1598 0.1488 0.1451 0.1618 0.1572 0.1612 0.1574
va: 1.2707 1.2454 2.1372 2.0603 2.0813 3.1113 3.7090 3.8739 3.8628 3.9132 3.9107 3.9022 4.1711 4.2146 3.7453 3.6248 4.0621 3.9156 3.9903 3.7589 3.9105 4.0230 3.7168 4.0006 3.8857 3.8929 3.8923 3.9236 1.0447 1.0328 0.9960 1.0021 1.0148 1.0059 1.0005 1.0012 1.0197 1.0177 1.0167 1.0081 0.9896 1.0042 1.0082 0.9902 0.9888 0.9891 0.9909
dispcorr: -0.025233382 hartree
energy: -2050.711282596206
dipole: 6.00386 -7.08033 -1.07647 -31.47120 30.47522 -0.99598 -13.65252 12.04971 -1.60282
magnitude: 2.17251 au
magnitude: 5.52207 debye
