program: Orca
programVersion: 5.0.2
elementType: Cl Cl O O O N C C C C C C C C C C C C C C C C C C C C C C H H H H H H H H H H H H H H H H H H H
charge: 0
multiplicity: 1
keywords: wb97x-d3
keywords: def2-TZVPP
keywords: def2/J RIJCOSX
keywords: DEFGRID2
keywords: scfconv7
keywords: smallprint printgap noloewdin
keywords: NOSOSCF
formula: C22H19Cl2NO3
InChI: InChI=1/C22H19Cl2NO3/c1-22(2)17(12-19(23)24)20(22)21(26)28-18(13-25)14-7-6-10-16(11-14)27-15-8-4-3-5-9-15/h3-12,17-18,20H,1-2H3
47 atoms
Cl -3.04708 3.566258 0.645027
Cl -3.162086 6.422531 0.235836
O  0.159949 0.897471 0.606988
O  -0.789432 0.546368 -1.384172
O  1.950861 -4.732443 -0.718785
N  0.274504 -0.744958 3.467709
C  0.415757 3.381434 -2.014543
C  -1.028382 3.523327 -1.681326
C  -0.129827 2.759544 -0.734318
C  0.812165 2.513404 -3.182794
C  1.335426 4.559385 -1.804266
C  -1.606645 4.812303 -1.240634
C  -0.306727 1.308517 -0.587554
C  -2.489952 4.918495 -0.258541
C  0.097301 -0.490145 0.872718
C  1.220921 -1.272302 0.224799
C  0.198596 -0.610384 2.329899
C  1.035739 -2.634042 0.032717
C  2.419937 -0.663031 -0.117922
C  2.073948 -3.395864 -0.485902
C  3.43386 -1.433986 -0.669143
C  3.274611 -2.798717 -0.845605
C  1.243529 -5.523784 0.147073
C  1.349688 -5.388242 1.525915
C  0.454043 -6.519136 -0.409306
C  0.641454 -6.254265 2.346167
C  -0.237506 -7.386548 0.424316
C  -0.153426 -7.254831 1.802958
H  -1.704734 2.902153 -2.263944
H  0.156717 3.272954 0.176285
H  0.074786 1.749206 -3.420498
H  1.767637 2.018009 -2.99736
H  0.932249 3.136137 -4.072305
H  1.317165 5.220852 -2.673305
H  2.364204 4.219922 -1.670255
H  1.070261 5.152784 -0.928199
H  -1.314936 5.717708 -1.761091
H  -0.870663 -0.909979 0.576098
H  0.087373 -3.091038 0.291004
H  2.575632 0.396412 0.03609
H  4.369163 -0.967704 -0.9493
H  4.073615 -3.399697 -1.261214
H  1.975785 -4.620471 1.963093
H  0.385867 -6.615518 -1.485421
H  0.720293 -6.146608 3.420167
H  -0.850808 -8.164739 -0.011036
H  -0.700124 -7.92814 2.449903
elementType: Cl O N C H
totalener: -2050.68400631 hartree
nucrepener: 2713.52314960 hartree
electener: -4764.20715591 hartree
oneelecener: -8202.60962196 hartree
twoeener: 3438.40246605 hartree
cpcmener: -0.03085497 hartree
kineticenergy: 2044.48013167 hartree
xcener: -151.864805915184 hartree
chargesum: -0.0000000
charge: -0.049380 -0.054418 -0.285293 -0.437863 -0.327233 -0.086323 0.138457 -0.032787 -0.136622 -0.269823 -0.281830 -0.213500 0.383676 0.073096 0.395806 0.045630 -0.225585 -0.213612 -0.209428 0.264655 -0.130233 -0.221667 0.282064 -0.190851 -0.247963 -0.140742 -0.119878 -0.186254 0.114076 0.114788 0.096673 0.098575 0.097946 0.102294 0.099587 0.095235 0.139963 0.143038 0.145393 0.146642 0.158148 0.148641 0.155722 0.146026 0.159568 0.157896 0.157691
qa: -0.0494 -0.0544 -0.2853 -0.4379 -0.3272 -0.0863 0.1385 -0.0328 -0.1366 -0.2698 -0.2818 -0.2135 0.3837 0.0731 0.3958 0.0456 -0.2256 -0.2136 -0.2094 0.2647 -0.1302 -0.2217 0.2821 -0.1909 -0.2480 -0.1407 -0.1199 -0.1863 0.1141 0.1148 0.0967 0.0986 0.0979 0.1023 0.0996 0.0952 0.1400 0.1430 0.1454 0.1466 0.1581 0.1486 0.1557 0.1460 0.1596 0.1579 0.1577
va: 1.2815 1.2518 2.1070 2.0710 2.0819 3.1150 3.7124 3.8935 3.8348 3.8894 3.9174 3.9046 4.1430 4.1878 3.7327 3.6291 4.0603 3.9846 3.9503 3.7419 3.9210 4.0060 3.6927 3.9098 4.0108 3.8900 3.8835 3.9076 1.0214 1.0244 1.0172 1.0002 1.0020 0.9995 1.0030 0.9988 1.0081 1.0212 1.0054 1.0121 0.9902 1.0048 0.9980 1.0081 0.9901 0.9891 0.9906
dispcorr: -0.024346405 hartree
energy: -2050.708352712094
dipole: 24.12560 -23.21139 0.91421 -20.89211 21.62310 0.73099 -14.47173 12.80076 -1.67097
magnitude: 2.04016 au
magnitude: 5.18568 debye
