program: Orca
programVersion: 5.0.2
elementType: Cl Cl O O O N C C C C C C C C C C C C C C C C C C C C C C H H H H H H H H H H H H H H H H H H H
charge: 0
multiplicity: 1
keywords: wb97x-d3
keywords: def2-TZVPP
keywords: def2/J RIJCOSX
keywords: DEFGRID2
keywords: scfconv7
keywords: smallprint printgap noloewdin
keywords: NOSOSCF
formula: C22H19Cl2NO3
InChI: InChI=1/C22H19Cl2NO3/c1-22(2)17(12-19(23)24)20(22)21(26)28-18(13-25)14-7-6-10-16(11-14)27-15-8-4-3-5-9-15/h3-12,17-18,20H,1-2H3
47 atoms
Cl -2.282028 -0.044011 -1.497324
Cl -4.281679 0.187528 0.568215
O  2.066677 2.006929 -0.181704
O  2.236093 1.965007 2.042518
O  0.5533 -2.763388 -0.98025
N  4.106638 1.515871 -2.733881
C  -0.441718 3.71424 0.160274
C  -0.815056 2.264893 0.059099
C  0.208766 2.71844 1.095148
C  0.310955 4.334481 -0.992063
C  -1.389214 4.687168 0.822975
C  -2.097219 1.729858 0.529289
C  1.590958 2.21259 1.055856
C  -2.781734 0.75556 -0.05853
C  3.251969 1.227227 -0.282449
C  2.962288 -0.226129 0.011352
C  3.715675 1.401382 -1.660256
C  1.89281 -0.845192 -0.628091
C  3.716587 -0.918688 0.945053
C  1.589061 -2.157998 -0.320003
C  3.406004 -2.241201 1.234741
C  2.339792 -2.866404 0.610019
C  -0.606681 -3.019369 -0.30482
C  -0.93953 -2.410157 0.898937
C  -1.479653 -3.918108 -0.906753
C  -2.157345 -2.710884 1.494574
C  -2.691964 -4.204317 -0.299529
C  -3.037581 -3.60666 0.905781
H  -0.394004 1.758905 -0.801251
H  -0.152157 2.76735 2.116319
H  0.85908 3.615089 -1.595069
H  1.016099 5.088194 -0.636679
H  -0.397496 4.836021 -1.653763
H  -2.170476 4.994961 0.125714
H  -0.84913 5.583909 1.131737
H  -1.873639 4.280655 1.710078
H  -2.523553 2.146662 1.433868
H  4.039878 1.604187 0.377142
H  1.292251 -0.317251 -1.359914
H  4.540418 -0.430229 1.449645
H  3.994428 -2.785493 1.96125
H  2.092926 -3.895661 0.839343
H  -0.275747 -1.698583 1.372942
H  -1.208919 -4.384905 -1.845866
H  -2.416382 -2.23147 2.429713
H  -3.368102 -4.904861 -0.772866
H  -3.984463 -3.83397 1.377426
elementType: Cl O N C H
totalener: -2050.68268838 hartree
nucrepener: 2955.24245174 hartree
electener: -5005.92514013 hartree
oneelecener: -8685.98578067 hartree
twoeener: 3680.06064054 hartree
cpcmener: -0.03257964 hartree
kineticenergy: 2044.47338371 hartree
xcener: -151.865864188772 hartree
chargesum: 0.0000000
charge: -0.058874 -0.062845 -0.280159 -0.431784 -0.324276 -0.083867 0.090957 0.032511 -0.055254 -0.257530 -0.273184 -0.216691 0.369423 0.072681 0.391189 -0.008422 -0.234673 -0.189529 -0.161749 0.188196 -0.132009 -0.143657 0.271855 -0.158056 -0.231811 -0.202152 -0.128024 -0.175494 0.085118 0.095295 0.092164 0.100750 0.095652 0.101725 0.100000 0.091732 0.127257 0.141353 0.140298 0.146516 0.160490 0.157494 0.146229 0.143628 0.154780 0.156830 0.155917
qa: -0.0589 -0.0628 -0.2802 -0.4318 -0.3243 -0.0839 0.0910 0.0325 -0.0553 -0.2575 -0.2732 -0.2167 0.3694 0.0727 0.3912 -0.0084 -0.2347 -0.1895 -0.1617 0.1882 -0.1320 -0.1437 0.2719 -0.1581 -0.2318 -0.2022 -0.1280 -0.1755 0.0851 0.0953 0.0922 0.1007 0.0957 0.1017 0.1000 0.0917 0.1273 0.1414 0.1403 0.1465 0.1605 0.1575 0.1462 0.1436 0.1548 0.1568 0.1559
va: 1.2660 1.2387 2.1195 2.0773 2.0645 3.1077 3.7514 3.8491 3.8325 3.9030 3.9209 3.9279 4.2092 4.1799 3.7701 3.6285 4.0714 4.0174 3.9513 3.8266 3.8908 3.9579 3.6583 3.7811 3.9802 3.8905 3.9096 3.8757 1.0268 1.0289 1.0117 1.0007 1.0001 1.0004 1.0009 1.0055 1.0222 1.0145 1.0207 1.0023 0.9896 0.9952 1.0065 1.0090 0.9959 0.9884 0.9901
dispcorr: -0.029610028 hartree
energy: -2050.712298412742
dipole: 7.98859 -8.64019 -0.65160 10.94662 -10.26976 0.67685 8.31917 -6.64155 1.67762
magnitude: 1.92279 au
magnitude: 4.88735 debye
