program: Orca
programVersion: 5.0.2
elementType: Cl Cl O O O N C C C C C C C C C C C C C C C C C C C C C C H H H H H H H H H H H H H H H H H H H
charge: 0
multiplicity: 1
keywords: wb97x-d3
keywords: def2-TZVPP
keywords: def2/J RIJCOSX
keywords: DEFGRID2
keywords: scfconv7
keywords: smallprint printgap noloewdin
keywords: NOSOSCF
formula: C22H19Cl2NO3
InChI: InChI=1/C22H19Cl2NO3/c1-22(2)17(12-19(23)24)20(22)21(26)28-18(13-25)14-7-6-10-16(11-14)27-15-8-4-3-5-9-15/h3-12,17-18,20H,1-2H3
47 atoms
Cl -1.401804 2.679599 -2.858522
Cl -4.053244 3.819414 -2.711129
O  1.072558 1.057265 0.207953
O  1.899809 3.023675 -0.440535
O  0.095068 -3.852055 0.308584
N  2.659373 0.428709 -2.716993
C  -0.59627 4.101606 1.205397
C  -0.817216 4.189851 -0.263227
C  -0.365784 2.873417 0.332434
C  0.569525 4.838495 1.814415
C  -1.79463 4.011631 2.118221
C  -2.16709 4.289035 -0.860295
C  0.977322 2.381291 -0.006828
C  -2.499134 3.677755 -1.988336
C  2.305627 0.440998 -0.123205
C  2.288974 -0.981999 0.375962
C  2.489247 0.4554 -1.581203
C  1.180882 -1.789439 0.153475
C  3.403807 -1.479427 1.035309
C  1.197769 -3.105193 0.592842
C  3.410506 -2.800729 1.457846
C  2.317033 -3.621836 1.238342
C  -0.240856 -4.917323 1.103897
C  -0.33931 -4.791751 2.484157
C  -0.538946 -6.116879 0.476046
C  -0.724948 -5.890599 3.237271
C  -0.936539 -7.204897 1.241175
C  -1.023117 -7.099678 2.622049
H  -0.043466 4.713842 -0.819238
H  -1.117486 2.098315 0.430411
H  0.25194 5.836857 2.120507
H  1.406404 4.960039 1.130123
H  0.931898 4.321364 2.704759
H  -2.168588 5.009313 2.357008
H  -1.523962 3.527019 3.057741
H  -2.616739 3.443441 1.68159
H  -2.91228 4.910858 -0.377205
H  3.14777 0.978265 0.323126
H  0.305209 -1.413465 -0.362376
H  4.261797 -0.844163 1.214533
H  4.27964 -3.199705 1.963849
H  2.34529 -4.652676 1.566598
H  -0.118901 -3.849337 2.970588
H  -0.464911 -6.195914 -0.601389
H  -0.797449 -5.795875 4.313064
H  -1.171817 -8.140834 0.751053
H  -1.325554 -7.952189 3.215787
elementType: Cl O N C H
totalener: -2050.68520829 hartree
nucrepener: 2700.28115507 hartree
electener: -4750.96636336 hartree
oneelecener: -8176.58064797 hartree
twoeener: 3425.61428461 hartree
cpcmener: -0.03262688 hartree
kineticenergy: 2044.47922310 hartree
xcener: -151.863876223474 hartree
chargesum: 0.0000000
charge: -0.049787 -0.054747 -0.281449 -0.440927 -0.323465 -0.089504 0.128084 -0.038785 -0.121299 -0.266170 -0.280204 -0.212703 0.393348 0.073034 0.425490 -0.003188 -0.235329 -0.219921 -0.186147 0.237216 -0.144223 -0.174059 0.265689 -0.188563 -0.231547 -0.144852 -0.128609 -0.175235 0.114286 0.113214 0.096904 0.094491 0.100662 0.102223 0.100261 0.094013 0.141325 0.129636 0.135379 0.146721 0.159923 0.157316 0.158788 0.146546 0.159202 0.158249 0.158709
qa: -0.0498 -0.0547 -0.2814 -0.4409 -0.3235 -0.0895 0.1281 -0.0388 -0.1213 -0.2662 -0.2802 -0.2127 0.3933 0.0730 0.4255 -0.0032 -0.2353 -0.2199 -0.1861 0.2372 -0.1442 -0.1741 0.2657 -0.1886 -0.2315 -0.1449 -0.1286 -0.1752 0.1143 0.1132 0.0969 0.0945 0.1007 0.1022 0.1003 0.0940 0.1413 0.1296 0.1354 0.1467 0.1599 0.1573 0.1588 0.1465 0.1592 0.1582 0.1587
va: 1.2837 1.2516 2.1546 2.0637 2.0808 3.1124 3.7312 3.8785 3.8403 3.8905 3.9160 3.8990 4.1559 4.1880 3.7160 3.7631 4.0156 4.0681 3.9567 3.8156 3.9256 3.8967 3.6977 3.9211 4.0071 3.8890 3.8865 3.8988 1.0241 1.0195 1.0013 1.0164 0.9994 0.9996 1.0030 0.9992 1.0076 1.0232 1.0298 1.0025 0.9916 0.9960 0.9950 1.0071 0.9903 0.9893 0.9902
dispcorr: -0.023307502 hartree
energy: -2050.708515792898
dipole: 10.14581 -10.66664 -0.52083 -11.37529 10.91911 -0.45619 33.62219 -30.01778 3.60442
magnitude: 3.67031 au
magnitude: 9.32920 debye
