program: Orca
programVersion: 5.0.2
elementType: Cl Cl O O O N C C C C C C C C C C C C C C C C C C C C C C H H H H H H H H H H H H H H H H H H H
charge: 0
multiplicity: 1
keywords: wb97x-d3
keywords: def2-TZVPP
keywords: def2/J RIJCOSX
keywords: DEFGRID2
keywords: scfconv7
keywords: smallprint printgap noloewdin
keywords: NOSOSCF
formula: C22H19Cl2NO3
InChI: InChI=1/C22H19Cl2NO3/c1-22(2)17(12-19(23)24)20(22)21(26)28-18(13-25)14-7-6-10-16(11-14)27-15-8-4-3-5-9-15/h3-12,17-18,20H,1-2H3
47 atoms
Cl -2.256862 -0.110673 -0.7828
Cl -4.332879 0.822231 0.986896
O  2.074612 2.089738 -0.268067
O  2.199431 2.207735 1.955781
O  0.408015 -2.637473 -1.091424
N  4.179381 1.37557 -2.703688
C  -0.293308 3.979141 -0.186641
C  -0.802986 2.577062 -0.04562
C  0.283377 3.095789 0.897185
C  0.481791 4.331636 -1.43446
C  -1.128865 5.134712 0.31365
C  -2.113881 2.246843 0.522642
C  1.602539 2.442507 0.935731
C  -2.797969 1.136849 0.270793
C  3.206575 1.228996 -0.28431
C  2.814618 -0.189615 0.052174
C  3.737361 1.319387 -1.645631
C  1.773036 -0.788674 -0.646937
C  3.457046 -0.869647 1.074881
C  1.38789 -2.079337 -0.325289
C  3.0649 -2.165933 1.381702
C  2.035022 -2.779319 0.688004
C  -0.596506 -3.376726 -0.531719
C  -1.13891 -4.378368 -1.325479
C  -1.11178 -3.11864 0.732749
C  -2.206242 -5.125373 -0.850441
C  -2.172596 -3.882827 1.198178
C  -2.724567 -4.887104 0.415177
H  -0.446199 1.894592 -0.807662
H  -0.054815 3.338018 1.898264
H  1.271888 5.050652 -1.212538
H  -0.193548 4.79908 -2.153209
H  0.930827 3.474627 -1.928641
H  -1.909585 5.382147 -0.407829
H  -0.503092 6.019649 0.440886
H  -1.607273 4.939737 1.272961
H  -2.561299 2.947483 1.217276
H  3.98949 1.582425 0.39423
H  1.262699 -0.266881 -1.448206
H  4.257458 -0.395401 1.627822
H  3.566942 -2.706434 2.172972
H  1.745872 -3.793798 0.931917
H  -0.731756 -4.562899 -2.311835
H  -0.706976 -2.327495 1.350416
H  -2.628679 -5.902022 -1.47476
H  -2.574216 -3.680737 2.182807
H  -3.554224 -5.47423 0.786002
elementType: Cl O N C H
totalener: -2050.68269668 hartree
nucrepener: 2894.73999094 hartree
electener: -4945.42268762 hartree
oneelecener: -8565.00415267 hartree
twoeener: 3619.58146505 hartree
cpcmener: -0.03201609 hartree
kineticenergy: 2044.48022730 hartree
xcener: -151.866608140863 hartree
chargesum: 0.0000000
charge: -0.057524 -0.060642 -0.276237 -0.435129 -0.321484 -0.084370 0.102543 0.012092 -0.058006 -0.257768 -0.283269 -0.201548 0.376931 0.058387 0.390538 0.016993 -0.234911 -0.234235 -0.184342 0.242708 -0.122216 -0.181628 0.318689 -0.262101 -0.226642 -0.119933 -0.141199 -0.188311 0.087383 0.095701 0.101563 0.095322 0.090972 0.103547 0.100172 0.093280 0.127923 0.140033 0.140507 0.146382 0.160234 0.157845 0.145780 0.151505 0.157679 0.158959 0.157823
qa: -0.0575 -0.0606 -0.2762 -0.4351 -0.3215 -0.0844 0.1025 0.0121 -0.0580 -0.2578 -0.2833 -0.2015 0.3769 0.0584 0.3905 0.0170 -0.2349 -0.2342 -0.1843 0.2427 -0.1222 -0.1816 0.3187 -0.2621 -0.2266 -0.1199 -0.1412 -0.1883 0.0874 0.0957 0.1016 0.0953 0.0910 0.1035 0.1002 0.0933 0.1279 0.1400 0.1405 0.1464 0.1602 0.1578 0.1458 0.1515 0.1577 0.1590 0.1578
va: 1.2747 1.2447 2.1235 2.0763 2.0614 3.1077 3.7447 3.8763 3.8185 3.9002 3.9227 3.9113 4.2149 4.1959 3.7688 3.6276 4.0700 4.0356 3.9714 3.7962 3.8929 3.9336 3.5904 4.0193 3.8827 3.8887 3.9014 3.9112 1.0264 1.0281 1.0010 1.0001 1.0126 0.9994 1.0004 1.0055 1.0214 1.0150 1.0250 1.0037 0.9902 0.9947 1.0090 1.0045 0.9891 0.9898 0.9903
dispcorr: -0.027171834 hartree
energy: -2050.709868519239
dipole: 9.22879 -10.02590 -0.79711 8.48024 -7.95364 0.52660 2.24233 -0.88554 1.35680
magnitude: 1.65939 au
magnitude: 4.21784 debye
