program: Orca
programVersion: 5.0.2
elementType: Cl Cl O O O N C C C C C C C C C C C C C C C C C C C C C C H H H H H H H H H H H H H H H H H H H
charge: 0
multiplicity: 1
keywords: wb97x-d3
keywords: def2-TZVPP
keywords: def2/J RIJCOSX
keywords: DEFGRID2
keywords: scfconv7
keywords: smallprint printgap noloewdin
keywords: NOSOSCF
formula: C22H19Cl2NO3
InChI: InChI=1/C22H19Cl2NO3/c1-22(2)17(12-19(23)24)20(22)21(26)28-18(13-25)14-7-6-10-16(11-14)27-15-8-4-3-5-9-15/h3-12,17-18,20H,1-2H3
47 atoms
Cl -2.454694 4.727377 1.869298
Cl -3.500679 5.907958 -0.545198
O  1.851434 1.072804 -1.266007
O  1.268091 1.451624 0.856373
O  0.832605 -3.786956 -0.659334
N  4.568259 0.267154 -2.94562
C  -1.566922 1.076547 -0.579062
C  -1.36844 2.468472 -0.044316
C  -0.301684 1.846705 -0.915281
C  -1.532908 -0.06648 0.405446
C  -2.520296 0.837282 -1.724246
C  -2.124626 3.613167 -0.566698
C  0.987654 1.46308 -0.313201
C  -2.617469 4.607639 0.159936
C  3.074234 0.510843 -0.815902
C  2.882909 -0.847052 -0.176659
C  3.900919 0.387941 -2.01847
C  1.934932 -1.722417 -0.689996
C  3.650735 -1.205573 0.920274
C  1.757269 -2.959894 -0.092133
C  3.475962 -2.457032 1.494517
C  2.533117 -3.341519 0.996944
C  0.018375 -4.556163 0.127634
C  -0.532491 -4.082534 1.311838
C  -0.289081 -5.825837 -0.338867
C  -1.384635 -4.903455 2.0360
C  -1.152811 -6.629951 0.390122
C  -1.698034 -6.177342 1.582981
H  -1.121975 2.51212 1.010253
H  -0.236426 2.189041 -1.942489
H  -2.538128 -0.245793 0.790848
H  -0.886393 0.114918 1.261799
H  -1.200855 -0.985302 -0.081817
H  -3.548386 0.782329 -1.361675
H  -2.291093 -0.111219 -2.212505
H  -2.476406 1.61259 -2.488105
H  -2.296801 3.662293 -1.635407
H  3.591524 1.18394 -0.124016
H  1.32666 -1.457095 -1.546577
H  4.37826 -0.514507 1.326687
H  4.077393 -2.746781 2.345706
H  2.407393 -4.314601 1.454715
H  -0.308817 -3.085862 1.671188
H  0.141929 -6.177618 -1.267401
H  -1.810611 -4.536703 2.960402
H  -1.392174 -7.619428 0.023415
H  -2.364311 -6.810496 2.153597
elementType: Cl O N C H
totalener: -2050.68605124 hartree
nucrepener: 2742.78382896 hartree
electener: -4793.46988019 hartree
oneelecener: -8260.66547720 hartree
twoeener: 3467.19559701 hartree
cpcmener: -0.03195951 hartree
kineticenergy: 2044.48325922 hartree
xcener: -151.866382336783 hartree
chargesum: 0.0000000
charge: -0.055194 -0.060242 -0.278747 -0.425557 -0.329579 -0.087007 0.101700 0.028647 -0.067635 -0.273518 -0.265647 -0.204576 0.352999 0.040840 0.405497 0.030149 -0.228761 -0.251390 -0.196821 0.243651 -0.126344 -0.170584 0.298903 -0.192720 -0.249340 -0.157476 -0.122217 -0.180577 0.078229 0.101444 0.107582 0.098301 0.090472 0.102752 0.099465 0.091827 0.129774 0.145134 0.138718 0.144549 0.160580 0.158683 0.154983 0.145725 0.158426 0.157459 0.157441
qa: -0.0552 -0.0602 -0.2787 -0.4256 -0.3296 -0.0870 0.1017 0.0286 -0.0676 -0.2735 -0.2656 -0.2046 0.3530 0.0408 0.4055 0.0301 -0.2288 -0.2514 -0.1968 0.2437 -0.1263 -0.1706 0.2989 -0.1927 -0.2493 -0.1575 -0.1222 -0.1806 0.0782 0.1014 0.1076 0.0983 0.0905 0.1028 0.0995 0.0918 0.1298 0.1451 0.1387 0.1445 0.1606 0.1587 0.1550 0.1457 0.1584 0.1575 0.1574
va: 1.2706 1.2446 2.1193 2.0838 2.0641 3.1118 3.7454 3.8900 3.8177 3.9029 3.9024 3.8982 4.2494 4.2132 3.7180 3.6053 4.0786 4.0072 3.9943 3.7850 3.8987 3.9177 3.6608 3.8902 4.0140 3.9148 3.8878 3.9038 1.0497 1.0309 1.0020 1.0151 1.0007 1.0008 1.0022 1.0054 1.0186 1.0147 1.0257 1.0026 0.9900 0.9936 0.9966 1.0084 0.9910 0.9892 0.9904
dispcorr: -0.025180262 hartree
energy: -2050.711231501298
dipole: 2.11219 -3.20569 -1.09350 -39.12469 37.89941 -1.22528 0.21103 0.63872 0.84975
magnitude: 1.84909 au
magnitude: 4.70002 debye
